{"text_format":"1","workbook":"xlsx","n_sheets":6,"sheets":["INTRODUCTION","MODELING","RETURN","SIMULATIONS","Sensitivity","CONTROLS"],"not_rendered":{"charts":1,"images":0,"macros":1,"external_links":1,"defined_names":178,"comments":0,"pivot_tables":0},"unopened":[],"bounds":{"document_bytes":16777216,"sheet_cells":100000,"rows_first":2000,"rows_last":500,"rows_between":2000,"halvings":0,"cell_chars":16384,"cell_head_chars":4096},"cells_cut":0,"cells_raw":0,"read":"whole","date_system":"1900"}

{"sheet":"INTRODUCTION","index":0,"n_rows":39,"n_cols":7,"rows_kept":39,"cut":false,"hidden":false,"merged":[]}
["PROJECT FINANCE MODELING"]
[]
["PHILIPPE DUCHEMIN",null,null,"2020-12-01",null,"Color Codes"]
[]
["BS CONTROL",{"$f":"MODELING!C259","v":true},null,"MODELLING",null,null,"Input Cell with link to INPUT TABLE"]
[null,null,null,"RETURN",null,null,"Input Cell without link to INPUT TABLE"]
[null,null,null,"SIMULATIONS",null,null,"Input Cell calculated"]
[null,null,null,"CONTROLS"]
{"$rows_left_out":32}
{"sheet":"MODELING","index":1,"n_rows":292,"n_cols":41,"rows_kept":292,"cut":false,"hidden":false,"merged":[]}
["PROJECT MODELING"]
[null,{"$f":"SIMULATIONS!AM4","v":3}]
["Calendar Year",null,"Year",2020,{"$f":"D3+1","v":2021},{"$f":"E3+1","v":2022},2023,2024,2025,2026,2027,2028,2029,2030,2031,2032,2033,2034,2035,2036,2037,2038,2039,2040,2041,2042,2043,2044,2045,2046,2047,2048,2049,2050,2051,2052,2053,2054]
["Durations",null,"Duration",1,{"$f":"D4+1","v":2},3,4,5,6,7,8,9,10,11,12,13,14,15,16,17,18,19,20,21,22,23,24,25,26,27,28,29,30,31,32,33,34,35]
["Construction","year","DurationConst",5,{"$f":"D5","v":5},5,{"$f":"F5","v":5},5,5,5,5,5,5,5,5,5,5,5,5,5,5,5,5,5,5,5,5,5,5,5,5,5,5,5,5,5,5,5]
["Production","year","DurationProd",25,25,25,25,25,25,25,25,25,25,25,25,25,25,25,25,25,25,25,25,25,25,25,25,25,25,25,25,25,25,25,25,25,25,25]
["Termination","year","DurationTerm",5,5,5,5,5,5,5,5,5,5,5,5,5,5,5,5,5,5,5,5,5,5,5,5,5,5,5,5,5,5,5,5,5,5,5]
["Project","year","DurationProject",{"$f":"D5+D6+D7","v":35},{"$f":"D8","v":35},35,35,35,35,35,35,35,35,35,35,35,35,35,35,35,35,35,35,35,35,35,35,35,35,35,35,35,35,35,35,35,35,35]
{"$rows_left_out":285}
{"sheet":"RETURN","index":2,"n_rows":119,"n_cols":40,"rows_kept":119,"cut":false,"hidden":false,"merged":[]}
["RETURN ANALYSIS"]
[null,null,null,null,null,null,null,null,null,null,null,null,null,null,null,null,null,null,null,null,null,null,null,null,null,null,null,null,null,null,null,"c"]
["WACC",{"$f":"+D6","v":0.1}]
[null,null,"year",{"$f":"INDIRECT($C4)","v":2020},2021,2022,2023,2024,2025,2026,2027,2028,2029,2030,2031,2032,2033,2034,2035,{"$f":"INDIRECT($C4)","v":2036},2037,2038,2039,2040,2041,2042,2043,2044,2045,2046,2047,2048,2049,2050,2051,{"$f":"INDIRECT($C4)","v":2052},2053,{"$f":"INDIRECT($C4)","v":2054}]
[null,null,"duration",1,2,3,4,5,6,7,8,9,10,11,12,13,14,15,16,17,18,19,20,21,22,23,24,25,26,27,28,29,30,31,32,33,34,{"$f":"INDIRECT($C5)","v":35}]
[null,null,"DF",0.1,0.1,0.1,0.1,0.1,0.1,0.1,0.1,0.1,0.1,0.1,0.1,0.1,0.1,0.1,0.1,0.1,0.1,0.1,0.1,0.1,0.1,0.1,0.1,0.1,0.1,0.1,0.1,0.1,0.1,0.1,0.1,0.1,0.1,{"$f":"INDIRECT($C6)","v":0.1}]
[" "," "]
["OPERATIONS CASH FLOW",null,null,null,null,null,null,null,null,null,null,null,null,null,null,null,null,null,null,null,null,null,null,null,null,null,null,null,null,null,null,null,null,null,null,null,null,null,null,"SOMME"]
{"$rows_left_out":112}
{"sheet":"SIMULATIONS","index":3,"n_rows":47,"n_cols":64,"rows_kept":47,"cut":false,"hidden":false,"merged":[]}
[null,null,null,"SCENARII TABLE",null,null,null,null,null,null,null,null,null,null,null,null,null,null,null,null,null,null,null,null,null,null,null,null,null,null,null,null,null,null,null,null,null,null,null,"OUTPUT TABLE"]
[null,null,null,null,1,2,3,4,5,6,7,8,9,10,11,12,13,14,15,16,17,18,19,20,21,22,23,24,25,26,27,28,29,30,31,32,33,34,null,1,2,3,4,5,6,7,8,9,10,11,12,13,14,15,16,17,18,19,20,21,22,23,24,25]
[null,null,null,null,"INFLATION RATE","INITIAL PRICE","PRICE INDEX","CAPACITY","AVAILABILITY","COSTOM","COSTFEE","COSTENV","TAXCA","TAXCAP","TAXCORP","DELAYSCASHIN","DELAYSCASHOUT","FINANCINGRATE","RPEQUITY","RPBQDEV","RPBQEXP","DURGRACE","DURDEV","DUREXP","DURCOM","AMODEV","AMOEXP","AMOCOM","RATEBQDEV","RATEBQEXP","RATEBQCOM","RATEDEPOSIT","RATEFUNDING","RATEDIVIDEND","RATERESERVE","YEARRESERVE","DF","DSCRTARGET",null,{"$f":"INDEX(INTRODUCTION!$B$15:$B$39,SIMULATIONS!AN2)","v":"OPERATIONS CASH FLOW BEF TAXES"},{"$f":"INDEX(INTRODUCTION!$B$15:$B$39,SIMULATIONS!AO2)","v":"OPEARATIONS CASH FLOW AFTER TAXES"},{"$f":"INDEX(INTRODUCTION!$B$15:$B$39,SIMULATIONS!AP2)","v":"OPERATIONS ACCOUNTING BEF TAXES"},{"$f":"INDEX(INTRODUCTION!$B$15:$B$39,SIMULATIONS!AQ2)","v":"OPERATIONS ACCOUNTING AFTER TAXES"},{"$f":"INDEX(INTRODUCTION!$B$15:$B$39,SIMULATIONS!AR2)","v":"PROJECT ACCOUNTING BEFORE TAXES"},{"$f":"INDEX(INTRODUCTION!$B$15:$B$39,SIMULATIONS!AS2)","v":"PROJECT ACCOUNTING AFTER TAXES"},{"$f":"INDEX(INTRODUCTION!$B$15:$B$39,SIMULATIONS!AT2)","v":"ROE"},{"$f":"INDEX(INTRODUCTION!$B$15:$B$39,SIMULATIONS!AU2)","v":"DEBT RETURN"},{"$f":"INDEX(INTRODUCTION!$B$15:$B$39,SIMULATIONS!AV2)","v":"FINANCE - WACC"},{"$f":"INDEX(INTRODUCTION!$B$15:$B$39,SIMULATIONS!AW2)","v":"PLCR Mini"},{"$f":"INDEX(INTRODUCTION!$B$15:$B$39,SIMULATIONS!AX2)","v":"PLCR Average"},{"$f":"INDEX(INTRODUCTION!$B$15:$B$39,SIMULATIONS!AY2)","v":"LLCR Mini"},{"$f":"INDEX(INTRODUCTION!$B$15:$B$39,SIMULATIONS!AZ2)","v":"LLCR Average"},{"$f":"INDEX(INTRODUCTION!$B$15:$B$39,SIMULATIONS!BA2)","v":"DSCR Mini"},{"$f":"INDEX(INTRODUCTION!$B$15:$B$39,SIMULATIONS!BB2)","v":"DSCR Average"},{"$f":"INDEX(INTRODUCTION!$B$15:$B$39,SIMULATIONS!BC2)","v":"Pay Back"},{"$f":"INDEX(INTRODUCTION!$B$15:$B$39,SIMULATIONS!BD2)","v":"OPERATIONS CASH FLOW BEF TAXES"},{"$f":"INDEX(INTRODUCTION!$B$15:$B$39,SIMULATIONS!BE2)","v":"OPEARATIONS CASH FLOW AFTER TAXES"},{"$f":"INDEX(INTRODUCTION!$B$15:$B$39,SIMULATIONS!BF2)","v":"OPERATIONS ACCOUNTING BEF TAXES"},{"$f":"INDEX(INTRODUCTION!$B$15:$B$39,SIMULATIONS!BG2)","v":"OPERATIONS ACCOUNTING AFTER TAXES"},{"$f":"INDEX(INTRODUCTION!$B$15:$B$39,SIMULATIONS!BH2)","v":"PROJECT ACCOUNTING BEFORE TAXES"},{"$f":"INDEX(INTRODUCTION!$B$15:$B$39,SIMULATIONS!BI2)","v":"PROJECT ACCOUNTING AFTER TAXES"},{"$f":"INDEX(INTRODUCTION!$B$15:$B$39,SIMULATIONS!BJ2)","v":"ROE NPV"},{"$f":"INDEX(INTRODUCTION!$B$15:$B$39,SIMULATIONS!BK2)","v":"DEBT NPV"},{"$f":"INDEX(INTRODUCTION!$B$15:$B$39,SIMULATIONS!BL2)","v":"FINANCE NPV"}]
[null,null,null,null,null,null,null,null,null,null,null,null,null,null,null,null,null,null,null,null,null,null,null,null,null,null,null,null,null,null,null,null,null,null,null,null,null,null,3,{"$f":"INDEX(INTRODUCTION!$E$15:$E$39,SIMULATIONS!AN2)","v":0.13178243169714943},{"$f":"INDEX(INTRODUCTION!$E$15:$E$39,SIMULATIONS!AO2)","v":0.10749064786314166},{"$f":"INDEX(INTRODUCTION!$E$15:$E$39,SIMULATIONS!AP2)","v":0.10463908398321076},{"$f":"INDEX(INTRODUCTION!$E$15:$E$39,SIMULATIONS!AQ2)","v":7.7394780792750639E-2},{"$f":"INDEX(INTRODUCTION!$E$15:$E$39,SIMULATIONS!AR2)","v":0.76299345525944573},{"$f":"INDEX(INTRODUCTION!$E$15:$E$39,SIMULATIONS!AS2)","v":0.20483309284484252},{"$f":"INDEX(INTRODUCTION!$E$15:$E$39,SIMULATIONS!AT2)","v":0.14521306368888043},{"$f":"INDEX(INTRODUCTION!$E$15:$E$39,SIMULATIONS!AU2)","v":4.4949194877712539E-2},{"$f":"INDEX(INTRODUCTION!$E$15:$E$39,SIMULATIONS!AV2)","v":0.1072348574929971},{"$f":"INDEX(INTRODUCTION!$E$15:$E$39,SIMULATIONS!AW2)","v":1.9670867638704488},{"$f":"INDEX(INTRODUCTION!$E$15:$E$39,SIMULATIONS!AX2)","v":4.8405055882455219},{"$f":"INDEX(INTRODUCTION!$E$15:$E$39,SIMULATIONS!AY2)","v":1.625876467546655},{"$f":"INDEX(INTRODUCTION!$E$15:$E$39,SIMULATIONS!AZ2)","v":2.4844565096046374},{"$f":"INDEX(INTRODUCTION!$E$15:$E$39,SIMULATIONS!BA2)","v":1.7808210147896573},{"$f":"INDEX(INTRODUCTION!$E$15:$E$39,SIMULATIONS!BB2)","v":2.9924261508987744},{"$f":"INDEX(INTRODUCTION!$E$15:$E$39,SIMULATIONS!BC2)","v":2025},{"$f":"INDEX(INTRODUCTION!$E$15:$E$39,SIMULATIONS!BD2)","v":80397.530421912001},{"$f":"INDEX(INTRODUCTION!$E$15:$E$39,SIMULATIONS!BE2)","v":17831.82763368106},{"$f":"INDEX(INTRODUCTION!$E$15:$E$39,SIMULATIONS!BF2)","v":10907.324099415677},{"$f":"INDEX(INTRODUCTION!$E$15:$E$39,SIMULATIONS!BG2)","v":-48855.76562609832},{"$f":"INDEX(INTRODUCTION!$E$15:$E$39,SIMULATIONS!BH2)","v":186824.59013568389},{"$f":"INDEX(INTRODUCTION!$E$15:$E$39,SIMULATIONS!BI2)","v":122412.45164596575},{"$f":"INDEX(INTRODUCTION!$E$15:$E$39,SIMULATIONS!BJ2)","v":-55654.220579113622},{"$f":"INDEX(INTRODUCTION!$E$15:$E$39,SIMULATIONS!BK2)","v":78055.313157911034},{"$f":"INDEX(INTRODUCTION!$E$15:$E$39,SIMULATIONS!BL2)","v":-17284.827573515307}]
[null,null,null,1,0.01,98,100,500,0.5,10,0.02,0.01,5.0000000000000001E-3,1.2500000000000001E-2,0.3,60,90,0.11,0.25,0.5,0.3,7,15,12,7,1,2,2,0.02,0.06,7.0000000000000007E-2,0.01,0.05,1,0.9,3,0.08,1.5,1,7.249008142975355E-2,5.4629486352819168E-2,2.9555793576374167E-2,4.9201960629985386E-3,0.39781799259182637,9.7655839298789626E-2,7.573173609201489E-2,4.0142021911247605E-2,5.4436662321672991E-2,1.349537791942429,5.4861185976830598,1.1154910552516406,2.4576840677372562,0.48993140429931648,1.8074090096600288,2025,-19341.265801988484,-61848.096927939179,-112743.22514035289,-151495.50562933405,83146.436622152192,20993.276963487526,4587.6407819172673,56096.753631547443,62612.625421809993]
[null,null,null,2,{"$f":"E5","v":0.01},{"$f":"F5","v":98},{"$f":"G5","v":100},500,1,10,0.02,0.01,5.0000000000000001E-3,1.2500000000000001E-2,0.3,60,90,0.11,0.25,0.5,0.3,7,15,12,7,1,2,2,0.02,0.06,7.0000000000000007E-2,0.01,0.05,1,0.9,3,0.08,1.5,2,8.4201620000567523E-2,6.4248896833003277E-2,4.652484403102819E-2,2.0785634967865674E-2,0.4555673384616552,0.12087276088028776,9.3440967468003677E-2,4.0142021911247605E-2,6.4076404598707892E-2,1.5313802529938005,6.4124096313909735,1.2651585345930794,2.8395217022293298,1.084780051327132,2.0803674702668418,2025,11488.405347965618,-40376.159462539101,-81550.779525172649,-129660.79369870783,114415.05259247529,52261.892933810646,-15633.007646378341,56096.753631547443,40979.121062384002]
[null,null,null,3,0.01,110,{"$f":"G6","v":100},{"$f":"H6","v":500},{"$f":"I6","v":1},2,1E-3,2.0000000000000001E-4,3.0000000000000001E-3,8.0000000000000002E-3,0.25,{"$f":"P6","v":60},{"$f":"Q6","v":90},0.16,0.25,0.4,0.4,9,20,15,10,2,3,3,{"$f":"AC6","v":0.02},{"$f":"AD6","v":0.06},{"$f":"AE6","v":7.0000000000000007E-2},5.0000000000000001E-3,0.1,{"$f":"AH6","v":1},{"$f":"AI6","v":0.9},{"$f":"AJ6","v":3},0.1,{"$f":"AL6","v":1.5},3,0.13178243169714943,0.10749064786314166,0.10463908398321076,7.7394780792750639E-2,0.76299345525944573,0.20483309284484252,0.14521306368887998,4.4949194877712539E-2,0.1072348574929971,1.9670867638704488,4.8405055882455219,1.625876467546655,2.4844565096046374,1.7808210147896573,2.9924261508987744,2025,80397.530421912001,17831.82763368106,10907.324099415677,-48855.76562609832,186824.59013568386,122412.45164596573,-55654.220579112705,78055.313157911034,-17284.827573515315]
[null,null,null,4,0.01,98,100,500,1,{"$f":"J7","v":2},{"$f":"K7","v":1E-3},{"$f":"L7","v":2.0000000000000001E-4},{"$f":"M7","v":3.0000000000000001E-3},{"$f":"N7","v":8.0000000000000002E-3},0.25,60,90,{"$f":"R7","v":0.16},0.25,0.4,0.4,{"$f":"V7","v":9},{"$f":"W7","v":20},{"$f":"X7","v":15},{"$f":"Y7","v":10},{"$f":"Z7","v":2},{"$f":"AA7","v":3},{"$f":"AB7","v":3},0.02,0.06,7.0000000000000007E-2,{"$f":"AF7","v":5.0000000000000001E-3},{"$f":"AG7","v":0.1},1,1,3,{"$f":"AK7","v":0.1},1.5,4,0.11751652344539387,9.5551152637077807E-2,8.7869429501082008E-2,6.2572461648331856E-2,0.64961635624389946,0.17283462430856078,0.12101603809812755,4.5721655146524709E-2,9.4863465709511319E-2,1.7355541452353094,3.2941115978002635,1.4346085664844093,1.79107146433766,1.7150438627793458,2.18730261320577,2025,42761.54261886092,-10249.922136299685,-27309.628032865599,-77518.479725309153,146227.14100784765,81815.002518129448,-24884.152645255104,79528.798613247374,11819.184106823097]
{"$rows_left_out":40}
{"sheet":"Sensitivity","index":4,"n_rows":36,"n_cols":28,"rows_kept":36,"cut":false,"hidden":false,"merged":[]}
[]
[null,null,null,"OPERATIONS CASH FLOW BEF TAXES","OPEARATIONS CASH FLOW AFTER TAXES","OPERATIONS ACCOUNTING BEF TAXES","OPERATIONS ACCOUNTING AFTER TAXES","PROJECT ACCOUNTING BEFORE TAXES","PROJECT ACCOUNTING AFTER TAXES","ROE","DEBT RETURN","FINANCE - WACC","PLCR Mini","PLCR Average","LLCR Mini","LLCR Average","DSCR Mini","DSCR Average","Pay Back","OPERATIONS CASH FLOW BEF TAXES","OPEARATIONS CASH FLOW AFTER TAXES","OPERATIONS ACCOUNTING BEF TAXES","OPERATIONS ACCOUNTING AFTER TAXES","PROJECT ACCOUNTING BEFORE TAXES","PROJECT ACCOUNTING AFTER TAXES","ROE NPV","DEBT NPV","FINANCE NPV"]
[1,"INFLATION RATE",0.01,{"$f":"SIGN(SIMULATIONS!AN14-SIMULATIONS!AN$13)","v":1},{"$f":"SIGN(SIMULATIONS!AO14-SIMULATIONS!AO$13)","v":1},{"$f":"SIGN(SIMULATIONS!AP14-SIMULATIONS!AP$13)","v":1},{"$f":"SIGN(SIMULATIONS!AQ14-SIMULATIONS!AQ$13)","v":1},{"$f":"SIGN(SIMULATIONS!AR14-SIMULATIONS!AR$13)","v":1},{"$f":"SIGN(SIMULATIONS!AS14-SIMULATIONS!AS$13)","v":1},{"$f":"SIGN(SIMULATIONS!AT14-SIMULATIONS!AT$13)","v":1},{"$f":"SIGN(SIMULATIONS!AU14-SIMULATIONS!AU$13)","v":-1},{"$f":"SIGN(SIMULATIONS!AV14-SIMULATIONS!AV$13)","v":1},{"$f":"SIGN(SIMULATIONS!AW14-SIMULATIONS!AW$13)","v":1},{"$f":"SIGN(SIMULATIONS!AX14-SIMULATIONS!AX$13)","v":1},{"$f":"SIGN(SIMULATIONS!AY14-SIMULATIONS!AY$13)","v":1},{"$f":"SIGN(SIMULATIONS!AZ14-SIMULATIONS!AZ$13)","v":1},{"$f":"SIGN(SIMULATIONS!BA14-SIMULATIONS!BA$13)","v":1},{"$f":"SIGN(SIMULATIONS!BB14-SIMULATIONS!BB$13)","v":1},{"$f":"SIGN(SIMULATIONS!BC14-SIMULATIONS!BC$13)","v":0},{"$f":"SIGN(SIMULATIONS!BD14-SIMULATIONS!BD$13)","v":1},{"$f":"SIGN(SIMULATIONS!BE14-SIMULATIONS!BE$13)","v":1},{"$f":"SIGN(SIMULATIONS!BF14-SIMULATIONS!BF$13)","v":1},{"$f":"SIGN(SIMULATIONS!BG14-SIMULATIONS!BG$13)","v":1},{"$f":"SIGN(SIMULATIONS!BH14-SIMULATIONS!BH$13)","v":1},{"$f":"SIGN(SIMULATIONS!BI14-SIMULATIONS!BI$13)","v":1},{"$f":"SIGN(SIMULATIONS!BJ14-SIMULATIONS!BJ$13)","v":-1},{"$f":"SIGN(SIMULATIONS!BK14-SIMULATIONS!BK$13)","v":-1},{"$f":"SIGN(SIMULATIONS!BL14-SIMULATIONS!BL$13)","v":-1}]
[2,"INITIAL PRICE",110,{"$f":"SIGN(SIMULATIONS!AN15-SIMULATIONS!AN$13)","v":1},{"$f":"SIGN(SIMULATIONS!AO15-SIMULATIONS!AO$13)","v":1},{"$f":"SIGN(SIMULATIONS!AP15-SIMULATIONS!AP$13)","v":1},{"$f":"SIGN(SIMULATIONS!AQ15-SIMULATIONS!AQ$13)","v":1},{"$f":"SIGN(SIMULATIONS!AR15-SIMULATIONS!AR$13)","v":1},{"$f":"SIGN(SIMULATIONS!AS15-SIMULATIONS!AS$13)","v":1},{"$f":"SIGN(SIMULATIONS!AT15-SIMULATIONS!AT$13)","v":1},{"$f":"SIGN(SIMULATIONS!AU15-SIMULATIONS!AU$13)","v":-1},{"$f":"SIGN(SIMULATIONS!AV15-SIMULATIONS!AV$13)","v":1},{"$f":"SIGN(SIMULATIONS!AW15-SIMULATIONS!AW$13)","v":1},{"$f":"SIGN(SIMULATIONS!AX15-SIMULATIONS!AX$13)","v":1},{"$f":"SIGN(SIMULATIONS!AY15-SIMULATIONS!AY$13)","v":1},{"$f":"SIGN(SIMULATIONS!AZ15-SIMULATIONS!AZ$13)","v":1},{"$f":"SIGN(SIMULATIONS!BA15-SIMULATIONS!BA$13)","v":1},{"$f":"SIGN(SIMULATIONS!BB15-SIMULATIONS!BB$13)","v":1},{"$f":"SIGN(SIMULATIONS!BC15-SIMULATIONS!BC$13)","v":0},{"$f":"SIGN(SIMULATIONS!BD15-SIMULATIONS!BD$13)","v":1},{"$f":"SIGN(SIMULATIONS!BE15-SIMULATIONS!BE$13)","v":1},{"$f":"SIGN(SIMULATIONS!BF15-SIMULATIONS!BF$13)","v":1},{"$f":"SIGN(SIMULATIONS!BG15-SIMULATIONS!BG$13)","v":1},{"$f":"SIGN(SIMULATIONS!BH15-SIMULATIONS!BH$13)","v":1},{"$f":"SIGN(SIMULATIONS!BI15-SIMULATIONS!BI$13)","v":1},{"$f":"SIGN(SIMULATIONS!BJ15-SIMULATIONS!BJ$13)","v":-1},{"$f":"SIGN(SIMULATIONS!BK15-SIMULATIONS!BK$13)","v":-1},{"$f":"SIGN(SIMULATIONS!BL15-SIMULATIONS!BL$13)","v":-1}]
[3,"PRICE INDEX",100,{"$f":"SIGN(SIMULATIONS!AN16-SIMULATIONS!AN$13)","v":1},{"$f":"SIGN(SIMULATIONS!AO16-SIMULATIONS!AO$13)","v":1},{"$f":"SIGN(SIMULATIONS!AP16-SIMULATIONS!AP$13)","v":1},{"$f":"SIGN(SIMULATIONS!AQ16-SIMULATIONS!AQ$13)","v":1},{"$f":"SIGN(SIMULATIONS!AR16-SIMULATIONS!AR$13)","v":1},{"$f":"SIGN(SIMULATIONS!AS16-SIMULATIONS!AS$13)","v":1},{"$f":"SIGN(SIMULATIONS!AT16-SIMULATIONS!AT$13)","v":1},{"$f":"SIGN(SIMULATIONS!AU16-SIMULATIONS!AU$13)","v":-1},{"$f":"SIGN(SIMULATIONS!AV16-SIMULATIONS!AV$13)","v":1},{"$f":"SIGN(SIMULATIONS!AW16-SIMULATIONS!AW$13)","v":1},{"$f":"SIGN(SIMULATIONS!AX16-SIMULATIONS!AX$13)","v":1},{"$f":"SIGN(SIMULATIONS!AY16-SIMULATIONS!AY$13)","v":1},{"$f":"SIGN(SIMULATIONS!AZ16-SIMULATIONS!AZ$13)","v":1},{"$f":"SIGN(SIMULATIONS!BA16-SIMULATIONS!BA$13)","v":1},{"$f":"SIGN(SIMULATIONS!BB16-SIMULATIONS!BB$13)","v":1},{"$f":"SIGN(SIMULATIONS!BC16-SIMULATIONS!BC$13)","v":0},{"$f":"SIGN(SIMULATIONS!BD16-SIMULATIONS!BD$13)","v":1},{"$f":"SIGN(SIMULATIONS!BE16-SIMULATIONS!BE$13)","v":1},{"$f":"SIGN(SIMULATIONS!BF16-SIMULATIONS!BF$13)","v":1},{"$f":"SIGN(SIMULATIONS!BG16-SIMULATIONS!BG$13)","v":1},{"$f":"SIGN(SIMULATIONS!BH16-SIMULATIONS!BH$13)","v":1},{"$f":"SIGN(SIMULATIONS!BI16-SIMULATIONS!BI$13)","v":1},{"$f":"SIGN(SIMULATIONS!BJ16-SIMULATIONS!BJ$13)","v":-1},{"$f":"SIGN(SIMULATIONS!BK16-SIMULATIONS!BK$13)","v":-1},{"$f":"SIGN(SIMULATIONS!BL16-SIMULATIONS!BL$13)","v":-1}]
[4,"CAPACITY",500,{"$f":"SIGN(SIMULATIONS!AN17-SIMULATIONS!AN$13)","v":1},{"$f":"SIGN(SIMULATIONS!AO17-SIMULATIONS!AO$13)","v":1},{"$f":"SIGN(SIMULATIONS!AP17-SIMULATIONS!AP$13)","v":1},{"$f":"SIGN(SIMULATIONS!AQ17-SIMULATIONS!AQ$13)","v":1},{"$f":"SIGN(SIMULATIONS!AR17-SIMULATIONS!AR$13)","v":1},{"$f":"SIGN(SIMULATIONS!AS17-SIMULATIONS!AS$13)","v":1},{"$f":"SIGN(SIMULATIONS!AT17-SIMULATIONS!AT$13)","v":1},{"$f":"SIGN(SIMULATIONS!AU17-SIMULATIONS!AU$13)","v":-1},{"$f":"SIGN(SIMULATIONS!AV17-SIMULATIONS!AV$13)","v":1},{"$f":"SIGN(SIMULATIONS!AW17-SIMULATIONS!AW$13)","v":1},{"$f":"SIGN(SIMULATIONS!AX17-SIMULATIONS!AX$13)","v":1},{"$f":"SIGN(SIMULATIONS!AY17-SIMULATIONS!AY$13)","v":1},{"$f":"SIGN(SIMULATIONS!AZ17-SIMULATIONS!AZ$13)","v":1},{"$f":"SIGN(SIMULATIONS!BA17-SIMULATIONS!BA$13)","v":1},{"$f":"SIGN(SIMULATIONS!BB17-SIMULATIONS!BB$13)","v":1},{"$f":"SIGN(SIMULATIONS!BC17-SIMULATIONS!BC$13)","v":0},{"$f":"SIGN(SIMULATIONS!BD17-SIMULATIONS!BD$13)","v":1},{"$f":"SIGN(SIMULATIONS!BE17-SIMULATIONS!BE$13)","v":1},{"$f":"SIGN(SIMULATIONS!BF17-SIMULATIONS!BF$13)","v":1},{"$f":"SIGN(SIMULATIONS!BG17-SIMULATIONS!BG$13)","v":1},{"$f":"SIGN(SIMULATIONS!BH17-SIMULATIONS!BH$13)","v":1},{"$f":"SIGN(SIMULATIONS!BI17-SIMULATIONS!BI$13)","v":1},{"$f":"SIGN(SIMULATIONS!BJ17-SIMULATIONS!BJ$13)","v":-1},{"$f":"SIGN(SIMULATIONS!BK17-SIMULATIONS!BK$13)","v":-1},{"$f":"SIGN(SIMULATIONS!BL17-SIMULATIONS!BL$13)","v":-1}]
[5,"AVAILABILITY",1,{"$f":"SIGN(SIMULATIONS!AN18-SIMULATIONS!AN$13)","v":1},{"$f":"SIGN(SIMULATIONS!AO18-SIMULATIONS!AO$13)","v":1},{"$f":"SIGN(SIMULATIONS!AP18-SIMULATIONS!AP$13)","v":1},{"$f":"SIGN(SIMULATIONS!AQ18-SIMULATIONS!AQ$13)","v":1},{"$f":"SIGN(SIMULATIONS!AR18-SIMULATIONS!AR$13)","v":1},{"$f":"SIGN(SIMULATIONS!AS18-SIMULATIONS!AS$13)","v":1},{"$f":"SIGN(SIMULATIONS!AT18-SIMULATIONS!AT$13)","v":1},{"$f":"SIGN(SIMULATIONS!AU18-SIMULATIONS!AU$13)","v":-1},{"$f":"SIGN(SIMULATIONS!AV18-SIMULATIONS!AV$13)","v":1},{"$f":"SIGN(SIMULATIONS!AW18-SIMULATIONS!AW$13)","v":1},{"$f":"SIGN(SIMULATIONS!AX18-SIMULATIONS!AX$13)","v":1},{"$f":"SIGN(SIMULATIONS!AY18-SIMULATIONS!AY$13)","v":1},{"$f":"SIGN(SIMULATIONS!AZ18-SIMULATIONS!AZ$13)","v":1},{"$f":"SIGN(SIMULATIONS!BA18-SIMULATIONS!BA$13)","v":1},{"$f":"SIGN(SIMULATIONS!BB18-SIMULATIONS!BB$13)","v":1},{"$f":"SIGN(SIMULATIONS!BC18-SIMULATIONS!BC$13)","v":1},{"$f":"SIGN(SIMULATIONS!BD18-SIMULATIONS!BD$13)","v":1},{"$f":"SIGN(SIMULATIONS!BE18-SIMULATIONS!BE$13)","v":1},{"$f":"SIGN(SIMULATIONS!BF18-SIMULATIONS!BF$13)","v":1},{"$f":"SIGN(SIMULATIONS!BG18-SIMULATIONS!BG$13)","v":1},{"$f":"SIGN(SIMULATIONS!BH18-SIMULATIONS!BH$13)","v":1},{"$f":"SIGN(SIMULATIONS!BI18-SIMULATIONS!BI$13)","v":1},{"$f":"SIGN(SIMULATIONS!BJ18-SIMULATIONS!BJ$13)","v":-1},{"$f":"SIGN(SIMULATIONS!BK18-SIMULATIONS!BK$13)","v":-1},{"$f":"SIGN(SIMULATIONS!BL18-SIMULATIONS!BL$13)","v":-1}]
[6,"COSTOM",2,{"$f":"SIGN(SIMULATIONS!AN19-SIMULATIONS!AN$13)","v":-1},{"$f":"SIGN(SIMULATIONS!AO19-SIMULATIONS!AO$13)","v":-1},{"$f":"SIGN(SIMULATIONS!AP19-SIMULATIONS!AP$13)","v":-1},{"$f":"SIGN(SIMULATIONS!AQ19-SIMULATIONS!AQ$13)","v":-1},{"$f":"SIGN(SIMULATIONS!AR19-SIMULATIONS!AR$13)","v":-1},{"$f":"SIGN(SIMULATIONS!AS19-SIMULATIONS!AS$13)","v":-1},{"$f":"SIGN(SIMULATIONS!AT19-SIMULATIONS!AT$13)","v":1},{"$f":"SIGN(SIMULATIONS!AU19-SIMULATIONS!AU$13)","v":1},{"$f":"SIGN(SIMULATIONS!AV19-SIMULATIONS!AV$13)","v":-1},{"$f":"SIGN(SIMULATIONS!AW19-SIMULATIONS!AW$13)","v":-1},{"$f":"SIGN(SIMULATIONS!AX19-SIMULATIONS!AX$13)","v":-1},{"$f":"SIGN(SIMULATIONS!AY19-SIMULATIONS!AY$13)","v":-1},{"$f":"SIGN(SIMULATIONS!AZ19-SIMULATIONS!AZ$13)","v":-1},{"$f":"SIGN(SIMULATIONS!BA19-SIMULATIONS!BA$13)","v":-1},{"$f":"SIGN(SIMULATIONS!BB19-SIMULATIONS!BB$13)","v":-1},{"$f":"SIGN(SIMULATIONS!BC19-SIMULATIONS!BC$13)","v":0},{"$f":"SIGN(SIMULATIONS!BD19-SIMULATIONS!BD$13)","v":-1},{"$f":"SIGN(SIMULATIONS!BE19-SIMULATIONS!BE$13)","v":-1},{"$f":"SIGN(SIMULATIONS!BF19-SIMULATIONS!BF$13)","v":-1},{"$f":"SIGN(SIMULATIONS!BG19-SIMULATIONS!BG$13)","v":-1},{"$f":"SIGN(SIMULATIONS!BH19-SIMULATIONS!BH$13)","v":-1},{"$f":"SIGN(SIMULATIONS!BI19-SIMULATIONS!BI$13)","v":-1},{"$f":"SIGN(SIMULATIONS!BJ19-SIMULATIONS!BJ$13)","v":-1},{"$f":"SIGN(SIMULATIONS!BK19-SIMULATIONS!BK$13)","v":1},{"$f":"SIGN(SIMULATIONS!BL19-SIMULATIONS!BL$13)","v":1}]
{"$rows_left_out":29}
{"sheet":"CONTROLS","index":5,"n_rows":69,"n_cols":38,"rows_kept":69,"cut":false,"hidden":false,"merged":[]}
[]
[null,"REVENUES",null,{"$f":"INDIRECT($B2)","v":0},0,0,0,0,57805.552755499994,58383.608283055,58967.444365885538,59557.118809544401,60152.689997639849,{"$f":"INDIRECT($B2)","v":60754.216897616243},61361.759066592414,61975.376657258341,62595.130423830924,63221.081728069228,63853.292545349934,64491.825470803422,65136.743725511464,65788.111162766567,66445.992274394244,{"$f":"INDIRECT($B2)","v":67110.452197138191},67781.556719109576,68459.372286300684,69143.966009163676,69835.405669255328,70533.759725947879,71239.097323207345,71951.48829643942,72671.003179403822,73397.713211197872,0,0,0,0,0]
[null,"COST",null,0,0,0,0,0,-1411.045220062623,-1425.2783957813824,-1439.6563700000438,-1454.180640285135,-1468.8527201754378,-1483.6741393617408,-1498.6464438687965,-1513.7711962395028,-1529.0499757213497,-1544.484378455156,-1560.0760176661302,-1575.8265238572849,-1591.7375450052425,-1607.8107467584587,-1624.0478126378998,-1640.4504442402144,-1657.0203614434183,-1673.7593026151465,-1690.6690248234934,-1707.7513040504859,-1725.0079354082211,-1742.4407333577101,-1760.051531930462,-1777.8421849528486,-1795.8145662732911,0,0,0,0,0]
[null,"TAX",null,0,0,0,0,0,-2965.3372633576482,-2996.8314887632228,-3028.6776575635695,-3060.8800329155665,-3093.4429355564871,-3126.3707446802841,-3159.6678988286603,-3193.3388967972219,-3227.388298556973,-3261.8207261914354,-3296.6408648496858,-3331.8534637155849,-3367.4633369935132,-3403.4753649108998,-3439.8944947378641,-3476.7257418242734,-3513.974190654541,-3551.6449959204933,-3589.7433836126288,-3628.2746521301178,-3667.2441734098766,-3706.6573940750782,-3746.5198366034465,-3786.8371005157105,-3827.6148635845766,0,0,0,0,0]
[null,"REVENUES",null,0,0,0,0,0,57805.552755499994,58383.608283055,58967.444365885538,59557.118809544401,60152.689997639849,60754.216897616243,61361.759066592414,61975.376657258341,62595.130423830924,63221.081728069228,63853.292545349934,64491.825470803422,65136.743725511464,65788.111162766567,66445.992274394244,67110.452197138191,67781.556719109576,68459.372286300684,69143.966009163676,69835.405669255328,70533.759725947879,71239.097323207345,71951.48829643942,72671.003179403822,73397.713211197872,0,0,0,0,0]
[null,"COST",null,0,0,0,0,0,-1411.045220062623,-1425.2783957813824,-1439.6563700000438,-1454.180640285135,-1468.8527201754378,-1483.6741393617408,-1498.6464438687965,-1513.7711962395028,-1529.0499757213497,-1544.484378455156,-1560.0760176661302,-1575.8265238572849,-1591.7375450052425,-1607.8107467584587,-1624.0478126378998,-1640.4504442402144,-1657.0203614434183,-1673.7593026151465,-1690.6690248234934,-1707.7513040504859,-1725.0079354082211,-1742.4407333577101,-1760.051531930462,-1777.8421849528486,-1795.8145662732911,0,0,0,0,0]
[null,"TAX",null,0,0,0,0,0,-2965.3372633576482,-2996.8314887632228,-3028.6776575635695,-3060.8800329155665,-3093.4429355564871,-3126.3707446802841,-3159.6678988286603,-3193.3388967972219,-3227.388298556973,-3261.8207261914354,-3296.6408648496858,-3331.8534637155849,-3367.4633369935132,-3403.4753649108998,-3439.8944947378641,-3476.7257418242734,-3513.974190654541,-3551.6449959204933,-3589.7433836126288,-3628.2746521301178,-3667.2441734098766,-3706.6573940750782,-3746.5198366034465,-3786.8371005157105,-3827.6148635845766,0,0,0,0,0]
[null,"INTLT",null,0,-1324.662,-3311.6550000000002,-5960.9789999999994,-10199.8974,-12451.822800000002,-13246.62,-13246.62,-13246.62,-13246.62,-12404.423110786429,-11500.660806079657,-10531.39015241792,-9492.416728828166,-8379.278464669198,-7187.2284312650463,-5911.2165191668291,-4545.8699284137083,-3085.4723944012003,-1523.9420668888047,-682.6922855513069,-517.05492131111055,-348.10480978611014,-175.77569603061002,0,0,0,0,0,0,0,0,0,0,0]
{"$rows_left_out":61}