{"text_format":"1","workbook":"xlsx","n_sheets":4,"sheets":["INTRODUCTION","MODELING","RETURN","SIMULATIONS"],"not_rendered":{"charts":0,"images":0,"macros":1,"external_links":2,"defined_names":144,"comments":0,"pivot_tables":0},"unopened":[],"bounds":{"document_bytes":16777216,"sheet_cells":100000,"rows_first":2000,"rows_last":500,"rows_between":2000,"halvings":0,"cell_chars":16384,"cell_head_chars":4096},"cells_cut":0,"cells_raw":0,"read":"whole","date_system":"1900"}

{"sheet":"INTRODUCTION","index":0,"n_rows":35,"n_cols":8,"rows_kept":35,"cut":false,"hidden":false,"merged":[]}
["PROJECT FINANCE MODELING"]
[]
["PHILIPPE DUCHEMIN",null,null,"2020-12-01",null,null,"Color Codes"]
[]
[null,null,null,null,null,null,null,"Input Cell with link to INPUT TABLE"]
[null,null,null,null,null,null,null,"Input Cell without link to INPUT TABLE"]
[null,"MODELLING",null,null,null,null,null,"Input Cell calculated"]
[]
[null,null,null,null,null,null,null,"CASH FLOW STATEMENT"]
[null,null,null,null,null,null,null,"INCOME STATEMENT"]
[1,"OPERATIONS CASH FLOW BEF TAXES",null,null,{"$f":"RETURN!B10","v":{"$error":"#NUM!"}},null,null,"BALANCE SHEET"]
[2,"OPEARATIONS CASH FLOW AFTER TAXES",null,null,{"$f":"RETURN!B12","v":{"$error":"#NUM!"}}]
[3,"OPERATIONS ACCOUNTING BEF TAXES",null,null,{"$f":"RETURN!B18","v":{"$error":"#NUM!"}},null,null,"SCENARIO CELL"]
[4,"OPERATIONS ACCOUNTING AFTER TAXES",null,null,{"$f":"RETURN!B20","v":{"$error":"#NUM!"}}]
[5,"PROJECT ACCOUNTING BEFORE TAXES",null,null,{"$f":"RETURN!B32","v":{"$error":"#NUM!"}}]
[6,"PROJECT ACCOUNTING AFTER TAXES",null,null,{"$f":"RETURN!B34","v":{"$error":"#NUM!"}}]
[7,"ROE",null,null,{"$f":"RETURN!B42","v":0}]
[8,"DEBT RETURN",null,null,{"$f":"RETURN!B48","v":0}]
[9,"FINANCE - WACC",null,null,{"$f":"+RETURN!B64","v":{"$error":"#NUM!"}}]
[10,"PLCR Mini",null,null,{"$f":"+MODELING!E255","v":{"$error":"#DIV/0!"}}]
[11,"PLCR Average",null,null,{"$f":"+MODELING!E256","v":{"$error":"#DIV/0!"}}]
[12,"LLCR Mini",null,null,{"$f":"+MODELING!H255","v":{"$error":"#DIV/0!"}}]
[13,"LLCR Average",null,null,{"$f":"+MODELING!H256","v":{"$error":"#DIV/0!"}}]
[14,"DSCR Mini",null,null,{"$f":"+MODELING!K255","v":{"$error":"#DIV/0!"}}]
[15,"DSCR Average",null,null,{"$f":"+MODELING!K256","v":{"$error":"#DIV/0!"}}]
[16,"Pay Back",null,null,{"$f":"+RETURN!C103","v":0}]
[17,"OPERATIONS CASH FLOW BEF TAXES",null,null,{"$f":"RETURN!A10","v":0}]
[18,"OPEARATIONS CASH FLOW AFTER TAXES",null,null,{"$f":"RETURN!A12","v":0}]
[19,"OPERATIONS ACCOUNTING BEF TAXES",null,null,{"$f":"RETURN!A18","v":0}]
[20,"OPERATIONS ACCOUNTING AFTER TAXES",null,null,{"$f":"RETURN!A20","v":0}]
[21,"PROJECT ACCOUNTING BEFORE TAXES",null,null,{"$f":"RETURN!A32","v":0}]
[22,"PROJECT ACCOUNTING AFTER TAXES",null,null,{"$f":"RETURN!A34","v":0}]
[23,"ROE NPV",null,null,{"$f":"RETURN!A42","v":8851670.57762352}]
[24,"DEBT NPV",null,null,{"$f":"RETURN!A48","v":11972513.049272735}]
[25,"FINANCE NPV",null,null,{"$f":"RETURN!A64","v":0}]

{"sheet":"MODELING","index":1,"n_rows":259,"n_cols":14,"rows_kept":259,"cut":false,"hidden":false,"merged":[]}
["OIL MODELING"]
[null,null,{"$f":"SIMULATIONS!U4","v":1}]
["Calendar Year",null,"Year",2020,{"$f":"D3+1","v":2021},{"$f":"E3+1","v":2022},2023,2024,2025,2026,2027]
["Durations",null,"Duration",1,{"$f":"D4+1","v":2},3,4,5,6,7,8]
["Construction","year","DurationConst",1,{"$f":"D5","v":1},1,1,1,1,1,1]
["Production","year","DurationProd",6,6,6,6,6,6,6,6]
["Termination","year","DurationTerm",1,1,1,1,1,1,1,1]
["Project","year","DurationProject",{"$f":"D5+D6+D7","v":8},8,8,8,8,8,8,8]
["Inflation","%","RateInflation",{"$f":"INDEX(TSCE,CSCE,$L9)","v":0.03},{"$f":"D9","v":0.03},0.03,0.03,0.03,0.03,0.03,0.03,1]
["Prices"]
["Initial Price","usd","PriceOil",{"$f":"INDEX(TSCE,CSCE,$L11)","v":18},{"$f":"D11","v":18},{"$f":"E11","v":18},18,18,18,18,18,2]
["Production"]
["Capacity","barrel/day","Capacity",0,4000,{"$f":"E13","v":4000},6000,6000,6000,6000,0," "]
["Availability","days","Availability",{"$f":"INDEX(TSCE,CSCE,$L14)","v":365},{"$f":"D14","v":365},365,365,365,365,365,365,3]
["Costs"]
["Fix","usd","CostFix",{"$f":"INDEX(TSCE,CSCE,$L16)","v":10000000},{"$f":"D16","v":10000000},{"$f":"E16","v":10000000},{"$f":"F16","v":10000000},{"$f":"G16","v":10000000},{"$f":"H16","v":10000000},{"$f":"I16","v":10000000},{"$f":"J16","v":10000000},4]
["Variable","usd/barrel","CostVar",{"$f":"INDEX(TSCE,CSCE,$L17)","v":4},{"$f":"D17","v":4},{"$f":"E17","v":4},4,4,4,{"$f":"I17","v":4},{"$f":"J17","v":4},5]
["Construction"]
["Profile","usd","Capex",40000000,10000000,10000000,0,0,0,0,10000000]
["Debt","usd","Capfi",50000000,-10000000,-10000000,-10000000,-10000000,0,0,-10000000]
["Equity","usd","Equity",20000000,0,0,0,0,0,0,-20000000,null,"part d'Equity dans le capex"]
["Amortization Fixed Assets"]
["Construction","year","AmoConst",{"$f":"INDEX(TSCE,CSCE,$L23)","v":5},{"$f":"D23","v":5},5,5,5,5,5,5,6]
["Operation","year","AmoProd",{"$f":"INDEX(TSCE,CSCE,$L24)","v":4},4,4,4,4,4,4,4,7]
["Termination","year","AmoTerm",{"$f":"INDEX(TSCE,CSCE,$L25)","v":1},1,1,1,1,1,1,1,8]
["Working Capital"]
["Collect","days","DelaysCashIn",{"$f":"INDEX(TSCE,CSCE,$L27)","v":30},{"$f":"D27","v":30},{"$f":"E27","v":30},30,30,30,30,30,9]
["Payments","days","DelaysCashOut",{"$f":"INDEX(TSCE,CSCE,$L28)","v":7},{"$f":"D28","v":7},7,7,7,7,7,7,10]
["Funding",null,null,null,null,null,null,null,null,null,null,null,"Tx d'augmentation du Capex, pour financement"]
["Debt","year","YearDebt",{"$f":"INDEX(TSCE,CSCE,$L30)","v":5},{"$f":"D30","v":5},5,5,5,5,5,5,11]
["Rate","%","RateDebt",{"$f":"INDEX(TSCE,CSCE,$L31)","v":7.0000000000000007E-2},7.0000000000000007E-2,7.0000000000000007E-2,7.0000000000000007E-2,7.0000000000000007E-2,7.0000000000000007E-2,7.0000000000000007E-2,7.0000000000000007E-2,12]
["Short Term","%","RateDeposit",{"$f":"INDEX(TSCE,CSCE,$L32)","v":0.05},0.05,0.05,0.05,0.05,0.05,0.05,0.05,13]
["Short Term","%","RateFunding",{"$f":"INDEX(TSCE,CSCE,$L33)","v":0.1},0.1,0.1,0.1,0.1,0.1,0.1,0.1,14]
["Tax Reserve Dividend"]
["CompTax","%","TaxCorp",{"$f":"INDEX(TSCE,CSCE,$L35)","v":0.25},{"$f":"D35","v":0.25},{"$f":"E35","v":0.25},0.25,0.25,0.25,0.25,0.25,15]
["Reserve","%","RateReserve",{"$f":"INDEX(TSCE,CSCE,$L36)","v":1},{"$f":"D36","v":1},1,1,1,1,1,1,16]
[null,"year","YearReserve",{"$f":"INDEX(TSCE,CSCE,$L37)","v":2},2,2,2,2,2,2,2,17]
["Dividend","%","RateDividend",{"$f":"INDEX(TSCE,CSCE,$L38)","v":1},1,1,1,1,1,1,1,18]
["NPV"]
["Discount Factor",null,"DF",{"$f":"INDEX(TSCE,CSCE,$L40)","v":0.1},{"$f":"D40","v":0.1},0.1,0.1,0.1,0.1,0.1,0.1,19]
[]
["PROJECT"]
[]
["YEARS",null,"Year",{"$f":"INDIRECT($C44)","v":2020},{"$f":"INDIRECT($C44)","v":2021},2022,2023,2024,2025,2026,2027]
[null,null,"YearConst",{"$f":"--(Duration<=DurationConst)","v":1},{"$f":"--(Duration<=DurationConst)","v":0},0,0,0,0,0,0,null,{"$f":"_xlfn.FORMULATEXT(K45)","v":"=--(Duration<=DurationConst)"}]
[null,null,"YearProd",{"$f":"--(Duration>DurationConst)*(Duration<=DurationProd+DurationConst)","v":0},1,1,1,1,1,1,0,null,{"$f":"_xlfn.FORMULATEXT(K46)","v":"=--(Duration>DurationConst)*(Duration<=DurationProd+DurationConst)"}]
[null,null,"YearTerm",{"$f":"--(Duration>DurationConst+DurationProd)","v":0},0,0,0,0,0,0,1,null,{"$f":"_xlfn.FORMULATEXT(K47)","v":"=--(Duration>DurationConst+DurationProd)"}]
[]
[null,null,"RateInflation",{"$f":"INDIRECT($C49)","v":0.03},{"$f":"INDIRECT($C49)","v":0.03},0.03,0.03,0.03,0.03,0.03,0.03]
[null,null,null,1,{"$f":"D50*(1+E49)","v":1.03},{"$f":"E50*(1+F49)","v":1.0609},1.092727,1.1255088100000001,1.1592740743000001,1.1940522965290001,1.2298738654248702,"Infla",{"$f":"_xlfn.FORMULATEXT(K50)","v":"=J50*(1+K49)"}]
[]
["REVENUE","barrel/day","Capacity"]
[null,"days","Availability"]
[null,"barrel/year",null,null,null,null,null,null,null,null,null,"Production",{"$f":"_xlfn.FORMULATEXT(K54)","v":{"$error":"#N/A"}}]
[null,null,"PriceOil"]
[null,null,null,null,null,null,null,null,null,null,null,"Price",{"$f":"_xlfn.FORMULATEXT(K56)","v":{"$error":"#N/A"}}]
[null,null,{"$f":"NPV(0.1,D57:J57)*1.1","v":0},null,null,null,null,null,null,null,null,"Revenues",{"$f":"_xlfn.FORMULATEXT(K57)","v":{"$error":"#N/A"}}]
[]
["COSTS",null,"CostFix"]
[null,null,null,null,null,null,null,null,null,null,null,"CoFix"]
[null,null,"CostVar"]
[null,null," ",null,null,null,null,null,null,null,null,"CoVar",{"$f":"_xlfn.FORMULATEXT(K62)","v":{"$error":"#N/A"}}]
[null,null,"ENV",null,null,null,null,null,null,null,null,"CoEN",{"$f":"_xlfn.FORMULATEXT(K63)","v":{"$error":"#N/A"}}]
[null,null,{"$f":"NPV(0.1,D64:J64)*1.1","v":0},null,null,null,null,null,null,null,null,"Cost",{"$f":"_xlfn.FORMULATEXT(K64)","v":{"$error":"#N/A"}}]
[]
["WORKING CAPITAL",null,"DelaysCashIn"]
[null,null,null,null,null,null,null,null,null,null,null,"WcPay",{"$f":"_xlfn.FORMULATEXT(K67)","v":{"$error":"#N/A"}}]
[null,null,"DelaysCashOut"]
[null,null,null,null,null,null,null,null,null,null,null,"WcRec",{"$f":"_xlfn.FORMULATEXT(K69)","v":{"$error":"#N/A"}}]
[null,null,null,null,null,null,null,null,null,null,null,"WcNeed",{"$f":"_xlfn.FORMULATEXT(K70)","v":{"$error":"#N/A"}}]
[null,null,{"$f":"NPV(0.1,D71:J71)*1.1","v":0},null,null,null,null,null,null,null,null,"WcVar"]
[]
["INVESTMENT",null,"Capex"]
[null,null,null,null,null,null,null,null,null,null,null,"CapConst",{"$f":"_xlfn.FORMULATEXT(K74)","v":{"$error":"#N/A"}}]
[null,null,null,null,null,null,null,null,null,null,null,"CapProd",{"$error":"#N/A"}]
[null,null,null,null,null,null,null,null,null,null,null,"CapTerm",{"$error":"#N/A"}]
[null,null,{"$f":"NPV(0.1,D77:J77)*1.1","v":0},null,null,null,null,null,null,null,null,"CFCapex",{"$f":"_xlfn.FORMULATEXT(K77)","v":{"$error":"#N/A"}}]
[null,null,null,null,null,null,null,null,null,null,null,"CapexCum",{"$f":"_xlfn.FORMULATEXT(K78)","v":{"$error":"#N/A"}}]
[]
["AMORTIZATION",null,null,null,null,null,null,null,null,null,null,"AmConst"]
{"$rows_left_out":180}
{"sheet":"RETURN","index":2,"n_rows":116,"n_cols":13,"rows_kept":116,"cut":false,"hidden":false,"merged":[]}
["RETURN ANALYSIS"]
[]
["WACC",{"$f":"+D6","v":0.1}]
[null,null,"year",{"$f":"INDIRECT($C4)","v":2020},2021,2022,2023,2024,2025,2026,2027]
[null,null,"duration",1,2,3,4,5,6,7,8]
[null,null,"DF",0.1,0.1,0.1,0.1,0.1,0.1,0.1,0.1]
[" "," "]
["OPERATIONS CASH FLOW",null,null,null,null,null,null,null,null,null,null,null,"SOMME"]
["NPV","IRR","SUM"]
[{"$f":"NPV(WACC,D10:K10)","v":0},{"$f":"IRR(D10:K10)","v":{"$error":"#NUM!"}},"CFOP",{"$f":"INDIRECT($C10)","v":0},0,0,0,0,0,0,0]
[{"$f":"NPV(WACC,D11:K11)","v":0},null,"TaxCorp",{"$f":"-PLPROD*TaxCorp","v":0},0,0,0,0,{"$f":"-PLPROD*TaxCorp","v":0},0,0]
[{"$f":"NPV(WACC,D12:K12)","v":0},{"$f":"IRR(D12:K12)","v":{"$error":"#NUM!"}},null,{"$f":"D10+D11","v":0},{"$f":"E10+E11","v":0},0,0,0,0,0,0]
[]
["OPERATIONS ACCOUNTING",null,null,null,null,null,null,null,null,null,null,null,"SOMME"]
["NPV","IRR","SUM"]
[{"$f":"NPV(WACC,D16:K16)","v":0},null,"CFCAPEX",{"$f":"INDIRECT($C16)","v":0},{"$f":"INDIRECT($C16)","v":0},0,0,0,0,0,0]
[{"$f":"NPV(WACC,D17:K17)","v":0},null,"PLPROD",{"$f":"INDIRECT($C17)","v":0},{"$f":"INDIRECT($C17)","v":0},0,0,0,0,0,0]
[{"$f":"NPV(WACC,D18:K18)","v":0},{"$f":"IRR(D18:K18)","v":{"$error":"#NUM!"}},{"$f":"SUM(D18:K18)","v":0},{"$f":"SUM(D16:D17)","v":0},0,0,0,0,0,0,0]
[{"$f":"NPV(WACC,D19:K19)","v":0},null,"TaxCorp",{"$f":"-D18*TaxCorp","v":0},{"$f":"-E18*TaxCorp","v":0},{"$f":"-F18*TaxCorp","v":0},{"$f":"-G18*TaxCorp","v":0},{"$f":"-H18*TaxCorp","v":0},{"$f":"-I18*TaxCorp","v":0},0,0]
[{"$f":"NPV(WACC,D20:K20)","v":0},{"$f":"IRR(D20:K20)","v":{"$error":"#NUM!"}},{"$f":"SUM(D20:K20)","v":0},{"$f":"D18+D19","v":0},{"$f":"E18+E19","v":0},0,0,0,0,0,0]
[]
["PROJECT CASH FLOWS",null,null,null,null,null,null,null,null,null,null,null,"SOMME"]
["NPV","IRR","SUM"]
[{"$f":"NPV(WACC,D24:K24)","v":20824183.626896251},null,"CFBEFTAX",{"$f":"INDIRECT($C24)","v":70000000},{"$f":"INDIRECT($C24)","v":-10000000},-10000000,-10000000,-10000000,0,0,-30000000]
[{"$f":"NPV(WACC,D25:K25)","v":0},null,"EQ",{"$f":"INDIRECT($C25)","v":0},0,0,0,0,0,0,0]
[{"$f":"NPV(WACC,D26:K26)","v":20824183.626896251},{"$f":"IRR(D26:K26)","v":0},{"$f":"SUM(D26:K26)","v":0},{"$f":"SUM(D24:D25)","v":70000000},-10000000,-10000000,-10000000,-10000000,0,0,-30000000]
[{"$f":"NPV(WACC,D27:K27)","v":-5206045.9067240627},null,"TaxCorp",{"$f":"-D26*TaxCorp","v":-17500000},2500000,2500000,2500000,2500000,0,0,7500000]
[{"$f":"NPV(WACC,D28:K28)","v":15618137.720172187},{"$f":"IRR(D28:K28)","v":-2.2204460492503131E-16},{"$f":"SUM(D28:K28)","v":0},{"$f":"D26+D27","v":52500000},{"$f":"E26+E27","v":-7500000},-7500000,-7500000,-7500000,0,0,-22500000]
[]
["PROJECT ACCOUNTING",null,null,null,null,null,null,null,null,null,null,null,"SOMME"]
["NPV","IRR","SUM"]
[{"$f":"NPV(WACC,D32:K32)","v":0},{"$f":"IRR(D32:K32)","v":{"$error":"#NUM!"}},"PLBEFTAX",{"$f":"INDIRECT($C32)","v":0},0,0,0,0,0,0,0]
[{"$f":"NPV(WACC,D33:K33)","v":0},null,"EQ",0,0,0,0,0,0,0,0]
[{"$f":"NPV(WACC,D34:K34)","v":0},{"$f":"IRR(D34:K34)","v":{"$error":"#NUM!"}},{"$f":"SUM(D34:K34)","v":0},{"$f":"D32+D33","v":0},{"$f":"E32+E33","v":0},0,0,0,0,0,0]
[{"$f":"NPV(WACC,D35:K35)","v":0},null,"TaxCorp",{"$f":"-D34*TaxCorp","v":0},0,0,0,0,0,0,0]
[{"$f":"NPV(WACC,D36:K36)","v":0},{"$f":"IRR(D36:K36)","v":{"$error":"#NUM!"}},{"$f":"SUM(D36:K36)","v":0},{"$f":"D34+D35","v":0},{"$f":"E34+E35","v":0},0,0,0,0,0,0]
[]
["ROE"]
["Equity"]
[{"$f":"NPV(WACC,D40:K40)","v":8851670.57762352},{"$f":"A40/$A$68","v":{"$error":"#DIV/0!"}},"EQUITY",{"$f":"INDIRECT($C40)","v":20000000},0,0,0,0,0,0,-20000000,null,{"$f":"SUM(D40:K40)","v":0}]
[{"$f":"NPV(WACC,D41:K41)","v":0},null,"DIVIDENDPAY",0,0,0,0,0,0,0,0,null,{"$f":"SUM(D41:K41)","v":0}]
[{"$f":"A40+A41","v":8851670.57762352},{"$f":"IRR(D42:K42)","v":0},{"$f":"SUM(D42:K42)","v":0},{"$f":"SUM(D40:D41)","v":20000000},0,0,0,0,0,0,-20000000,null,{"$f":"SUM(D42:K42)","v":0}]
[]
["DEBT RETURN"]
["DEBT"]
[{"$f":"NPV(WACC,D46:K46)","v":11972513.049272735},null,"CAPFI",{"$f":"INDIRECT($C46)","v":50000000},-10000000,-10000000,-10000000,-10000000,0,0,-10000000,null,{"$f":"SUM(D46:K46)","v":0}]
[{"$f":"NPV(WACC,D47:K47)","v":0},null,"INTLT",0,0,0,0,0,0,0,0,null,{"$f":"SUM(D47:K47)","v":0}]
[{"$f":"A46+A47","v":11972513.049272735},{"$f":"IRR(D48:K48)","v":0},{"$f":"SUM(D48:K48)","v":0},{"$f":"IF(An<>0,D46+D47,0)","v":50000000},-10000000,-10000000,-10000000,-10000000,0,0,-10000000,null,{"$f":"SUM(D48:K48)","v":0}]
["BANK ACCOUNTS"]
[{"$f":"NPV(WACC,D50:K50)","v":-20824183.626896251},null,"CF",{"$f":"-INDIRECT($C50)","v":-70000000},10000000,10000000,10000000,10000000,0,0,30000000,null,{"$f":"SUM(D50:K50)","v":0}]
[{"$f":"NPV(WACC,D51:K51)","v":0},null,"INTST",{"$f":"INDIRECT($C51)","v":0},0,0,0,0,0,0,0,null,{"$f":"SUM(D51:K51)","v":0}]
[{"$f":"A50+A51","v":-20824183.626896251},{"$f":"IF(ISERR(IRR(D52:K52)),\"\",IRR(D52:K52))","v":0},{"$f":"SUM(D52:K52)","v":0},{"$f":"SUM(D50:D51)","v":-70000000},10000000,10000000,10000000,10000000,0,0,30000000,null,{"$f":"SUM(D52:K52)","v":0}]
["DEBT"]
[{"$f":"NPV(WACC,D54:K54)","v":-8851670.57762352},null,"DT CF CFDSCR",{"$f":"D46+D50","v":-20000000},{"$f":"E46+E50","v":0},0,0,0,0,0,20000000,null,{"$f":"SUM(D54:K54)","v":0}]
[{"$f":"NPV(WACC,D55:K55)","v":0},null,"INTST INTLT",{"$f":"D47+D51","v":0},{"$f":"E47+E51","v":0},0,0,0,0,0,0,null,{"$f":"SUM(D55:K55)","v":0}]
[{"$f":"A54+A55","v":-8851670.57762352},{"$f":"IRR(D56:K56)","v":0},{"$f":"SUM(D56:K56)","v":0},{"$f":"SUM(D54:D55)","v":-20000000},0,0,0,0,0,0,20000000,null,{"$f":"SUM(D56:K56)","v":0}]
[null,null,"TaxCorp",{"$f":"-D55*TaxCorp","v":0},0,0,0,0,0,0,0,null,{"$f":"SUM(D57:K57)","v":0}]
[{"$f":"A56+A57","v":-8851670.57762352},{"$f":"IRR(D58:K58)","v":0},{"$f":"SUM(D58:K58)","v":0},{"$f":"D56+D57","v":-20000000},{"$f":"E56+E57","v":0},0,0,0,0,0,20000000,null,{"$f":"SUM(D58:K58)","v":0}]
[]
["FINANCE - WACC"]
["NPV","IRR","SUM"]
[{"$f":"NPV(WACC,D62:K62)","v":-8851670.57762352},null,"FINANCE",{"$f":"D58","v":-20000000},{"$f":"E58","v":0},0,0,0,0,0,20000000,null,{"$f":"SUM(D62:K62)","v":0}]
[{"$f":"NPV(WACC,D63:K63)","v":8851670.57762352},null,"EQUITY",{"$f":"D42","v":20000000},0,0,0,0,0,0,-20000000,null,{"$f":"SUM(D63:K63)","v":0}]
[{"$f":"A62+A63","v":0},{"$f":"IRR(D64:K64)","v":{"$error":"#NUM!"}},{"$f":"SUM(D64:K64)","v":0},{"$f":"D62+D63","v":0},{"$f":"E62+E63","v":0},0,0,0,0,0,0,null,{"$f":"SUM(D64:K64)","v":0}]
[]
["ECONOMIC COSTS",null,null,null,null,null,null,null,null,null,null,null,"SOMME"]
["NPV"]
[{"$f":"-NPV(WACC,D68:K68)","v":0},null,"PRODUCTION",{"$f":"-INDIRECT($C68)","v":0},0,0,0,0,0,0,0]
[]
["COSTS BEFORE TAXES"]
["NPV","UNIT COST","SUM"]
[{"$f":"NPV(WACC,D72:K72)","v":0},{"$f":"A72/$A$68","v":{"$error":"#DIV/0!"}},"REVENUES",0,0,0,0,0,0,0,0,null,{"$f":"SUM(D72:K72)","v":0}]
[{"$f":"NPV(WACC,D73:K73)","v":0},{"$f":"A73/$A$68","v":{"$error":"#DIV/0!"}},"COST",0,0,0,0,0,0,0,0,null,{"$f":"SUM(D73:K73)","v":0}]
[{"$f":"NPV(WACC,D74:K74)","v":0},{"$f":"A74/$A$68","v":{"$error":"#DIV/0!"}},"CFCAPEX",{"$f":"INDIRECT($C74)","v":0},0,0,0,0,0,0,0,null,{"$f":"SUM(D74:K74)","v":0}]
[{"$f":"SUM(A72:A74)","v":0},{"$f":"IRR(D75:K75)","v":{"$error":"#NUM!"}},{"$f":"SUM(D75:K75)","v":0},{"$f":"SUM(D72:D74)","v":0},0,0,0,0,0,0,0]
[{"$f":"NPV(WACC,D76:K76)","v":0},{"$f":"A76/$A$68","v":{"$error":"#DIV/0!"}},"WCVAR",0,0,0,0,0,{"$f":"INDIRECT($C76)","v":0},0,0,null,{"$f":"SUM(D76:K76)","v":0}]
[{"$f":"A75+A76","v":0},{"$f":"IRR(D77:K77)","v":{"$error":"#NUM!"}},{"$f":"SUM(D77:K77)","v":0},{"$f":"D75+D76","v":0},{"$f":"E75+E76","v":0},0,0,0,0,0,0]
[{"$f":"NPV(WACC,D78:K78)","v":0},{"$f":"A78/$A$68","v":{"$error":"#DIV/0!"}},"TAXCOPAY",{"$f":"INDIRECT($C78)","v":0},{"$f":"INDIRECT($C78)","v":0},0,0,0,0,0,0,null,{"$f":"SUM(D78:K78)","v":0}]
[{"$f":"A77+A78","v":0},{"$f":"IRR(D79:K79)","v":{"$error":"#NUM!"}},{"$f":"SUM(D79:K79)","v":0},{"$f":"D77+D78","v":0},{"$f":"E77+E78","v":0},0,0,0,0,0,0]
[{"$f":"NPV(WACC,D80:K80)","v":-8851670.57762352},{"$f":"A80/$A$68","v":{"$error":"#DIV/0!"}},"DEBT",{"$f":"D56","v":-20000000},0,0,0,0,0,0,20000000]
{"$rows_left_out":37}
{"sheet":"SIMULATIONS","index":3,"n_rows":12,"n_cols":46,"rows_kept":12,"cut":false,"hidden":false,"merged":[]}
["SCENARII TABLE",null,null,null,null,null,null,null,null,null,null,null,null,null,null,null,null,null,null,null,null,"OUTPUT TABLE"]
[null,1,2,3,4,5,6,7,8,9,10,11,12,13,14,15,16,17,18,19,null,1,2,3,4,5,6,7,8,9,10,11,12,13,14,15,16,17,18,19,20,21,22,23,24,25]
[null,"INFLATION RATE","PRICE OIL","CAPACITY","COSTFIX","COSTVAR","AMOCONS","AMOPROD","AMOTERM","DELAYSCASHIN","DELAYSCASHOUT","YEARDEBT","RATE DEBT","RATEDEPOSIT","RATEFUNDING","TAXCORP","RATERESERVE","YEARRESERVE","RATEDIVIDEND","DF",null,"OPERATIONS CASH FLOW BEF TAXES","OPEARATIONS CASH FLOW AFTER TAXES","OPERATIONS ACCOUNTING BEF TAXES","OPERATIONS ACCOUNTING AFTER TAXES","PROJECT ACCOUNTING BEFORE TAXES","PROJECT ACCOUNTING AFTER TAXES","ROE","DEBT RETURN","FINANCE - WACC","PLCR Mini","PLCR Average","LLCR Mini","LLCR Average","DSCR Mini","DSCR Average","Pay Back","OPERATIONS CASH FLOW BEF TAXES","OPEARATIONS CASH FLOW AFTER TAXES","OPERATIONS ACCOUNTING BEF TAXES","OPERATIONS ACCOUNTING AFTER TAXES","PROJECT ACCOUNTING BEFORE TAXES","PROJECT ACCOUNTING AFTER TAXES","ROE NPV","DEBT NPV","FINANCE NPV"]
[null,null,null,null,null,null,null,null,null,null,null,null,null,null,null,null,null,null,null,null,1,{"$f":"INDEX(INTRODUCTION!$E$11:$E$35,SIMULATIONS!V2)","v":{"$error":"#NUM!"}},{"$f":"INDEX(INTRODUCTION!$E$11:$E$35,SIMULATIONS!W2)","v":{"$error":"#NUM!"}},{"$f":"INDEX(INTRODUCTION!$E$11:$E$35,SIMULATIONS!X2)","v":{"$error":"#NUM!"}},{"$f":"INDEX(INTRODUCTION!$E$11:$E$35,SIMULATIONS!Y2)","v":{"$error":"#NUM!"}},{"$f":"INDEX(INTRODUCTION!$E$11:$E$35,SIMULATIONS!Z2)","v":{"$error":"#NUM!"}},{"$f":"INDEX(INTRODUCTION!$E$11:$E$35,SIMULATIONS!AA2)","v":{"$error":"#NUM!"}},{"$f":"INDEX(INTRODUCTION!$E$11:$E$35,SIMULATIONS!AB2)","v":0},{"$f":"INDEX(INTRODUCTION!$E$11:$E$35,SIMULATIONS!AC2)","v":0},{"$f":"INDEX(INTRODUCTION!$E$11:$E$35,SIMULATIONS!AD2)","v":{"$error":"#NUM!"}},{"$f":"INDEX(INTRODUCTION!$E$11:$E$35,SIMULATIONS!AE2)","v":{"$error":"#DIV/0!"}},{"$f":"INDEX(INTRODUCTION!$E$11:$E$35,SIMULATIONS!AF2)","v":{"$error":"#DIV/0!"}},{"$f":"INDEX(INTRODUCTION!$E$11:$E$35,SIMULATIONS!AG2)","v":{"$error":"#DIV/0!"}},{"$f":"INDEX(INTRODUCTION!$E$11:$E$35,SIMULATIONS!AH2)","v":{"$error":"#DIV/0!"}},{"$f":"INDEX(INTRODUCTION!$E$11:$E$35,SIMULATIONS!AI2)","v":{"$error":"#DIV/0!"}},{"$f":"INDEX(INTRODUCTION!$E$11:$E$35,SIMULATIONS!AJ2)","v":{"$error":"#DIV/0!"}},{"$f":"INDEX(INTRODUCTION!$E$11:$E$35,SIMULATIONS!AK2)","v":0},{"$f":"INDEX(INTRODUCTION!$E$11:$E$35,SIMULATIONS!AL2)","v":0},{"$f":"INDEX(INTRODUCTION!$E$11:$E$35,SIMULATIONS!AM2)","v":0},{"$f":"INDEX(INTRODUCTION!$E$11:$E$35,SIMULATIONS!AN2)","v":0},{"$f":"INDEX(INTRODUCTION!$E$11:$E$35,SIMULATIONS!AO2)","v":0},{"$f":"INDEX(INTRODUCTION!$E$11:$E$35,SIMULATIONS!AP2)","v":0},{"$f":"INDEX(INTRODUCTION!$E$11:$E$35,SIMULATIONS!AQ2)","v":0},{"$f":"INDEX(INTRODUCTION!$E$11:$E$35,SIMULATIONS!AR2)","v":8851670.57762352},{"$f":"INDEX(INTRODUCTION!$E$11:$E$35,SIMULATIONS!AS2)","v":11972513.049272735},{"$f":"INDEX(INTRODUCTION!$E$11:$E$35,SIMULATIONS!AT2)","v":0}]
[1,0.03,18,365,10000000,4,5,4,1,30,7,5,7.0000000000000007E-2,0.05,0.1,0.25,1,2,1,0.1,1,{"$error":"#NUM!"},{"$error":"#NUM!"},{"$error":"#NUM!"},{"$error":"#NUM!"},{"$error":"#NUM!"},{"$error":"#NUM!"},{"$error":"#NUM!"},{"$error":"#NUM!"},{"$error":"#NUM!"},{"$error":"#DIV/0!"},{"$error":"#DIV/0!"},{"$error":"#DIV/0!"},{"$error":"#DIV/0!"},{"$error":"#DIV/0!"},{"$error":"#DIV/0!"},0,0,0,0,0,0,0,0,0,0]
[2,{"$f":"B5","v":0.03},{"$f":"C5","v":18},365,10000000,4,5,4,1,{"$f":"J5","v":30},7,5,7.0000000000000007E-2,0.05,0.1,{"$f":"P5","v":0.25},1,2,{"$f":"S5","v":1},0.12,2,{"$error":"#NUM!"},{"$error":"#NUM!"},{"$error":"#NUM!"},{"$error":"#NUM!"},{"$error":"#NUM!"},{"$error":"#NUM!"},{"$error":"#NUM!"},{"$error":"#NUM!"},{"$error":"#NUM!"},{"$error":"#DIV/0!"},{"$error":"#DIV/0!"},{"$error":"#DIV/0!"},{"$error":"#DIV/0!"},{"$error":"#DIV/0!"},{"$error":"#DIV/0!"},0,0,0,0,0,0,0,0,0,0]
[3,{"$f":"B6","v":0.03},18,365,10000000,4,5,4,1,30,7,5,7.0000000000000007E-2,0.05,0.1,{"$f":"P6","v":0.25},1,2,1,0.08,3,{"$error":"#NUM!"},{"$error":"#NUM!"},{"$error":"#NUM!"},{"$error":"#NUM!"},{"$error":"#NUM!"},{"$error":"#NUM!"},{"$error":"#NUM!"},{"$error":"#NUM!"},{"$error":"#NUM!"},{"$error":"#DIV/0!"},{"$error":"#DIV/0!"},{"$error":"#DIV/0!"},{"$error":"#DIV/0!"},{"$error":"#DIV/0!"},{"$error":"#DIV/0!"},0,0,0,0,0,0,0,0,0,0]
[4,{"$f":"B7","v":0.03},18,365,10000000,5,5,4,1,30,7,5,7.0000000000000007E-2,0.05,0.1,{"$f":"P7","v":0.25},1,2,1,0.1,4,{"$error":"#NUM!"},{"$error":"#NUM!"},{"$error":"#NUM!"},{"$error":"#NUM!"},{"$error":"#NUM!"},{"$error":"#NUM!"},{"$error":"#NUM!"},{"$error":"#NUM!"},{"$error":"#NUM!"},{"$error":"#DIV/0!"},{"$error":"#DIV/0!"},{"$error":"#DIV/0!"},{"$error":"#DIV/0!"},{"$error":"#DIV/0!"},{"$error":"#DIV/0!"},0,0,0,0,0,0,0,0,0,0]
[5,{"$f":"B8","v":0.03},18,365,8000000,4,5,4,1,30,7,5,7.0000000000000007E-2,0.05,0.1,0.3,1,2,1,0.1,5,{"$error":"#NUM!"},{"$error":"#NUM!"},{"$error":"#NUM!"},{"$error":"#NUM!"},{"$error":"#NUM!"},{"$error":"#NUM!"},{"$error":"#NUM!"},{"$error":"#NUM!"},{"$error":"#NUM!"},{"$error":"#DIV/0!"},{"$error":"#DIV/0!"},{"$error":"#DIV/0!"},{"$error":"#DIV/0!"},{"$error":"#DIV/0!"},{"$error":"#DIV/0!"},0,0,0,0,0,0,0,0,0,0]
[6,0.03,18,365,10000000,4,5,4,1,30,7,5,0.08,0.05,0.1,{"$f":"P9","v":0.3},1,2,1,0.1,6,{"$error":"#NUM!"},{"$error":"#NUM!"},{"$error":"#NUM!"},{"$error":"#NUM!"},{"$error":"#NUM!"},{"$error":"#NUM!"},{"$error":"#NUM!"},{"$error":"#NUM!"},{"$error":"#NUM!"},{"$error":"#DIV/0!"},{"$error":"#DIV/0!"},{"$error":"#DIV/0!"},{"$error":"#DIV/0!"},{"$error":"#DIV/0!"},{"$error":"#DIV/0!"},0,0,0,0,0,0,0,0,0,0]
[7,0.03,19,365,10000000,4,5,4,1,30,7,5,7.0000000000000007E-2,0.05,0.1,{"$f":"P10","v":0.3},1,{"$f":"R10","v":2},1,0.1,7,{"$error":"#NUM!"},{"$error":"#NUM!"},{"$error":"#NUM!"},{"$error":"#NUM!"},{"$error":"#NUM!"},{"$error":"#NUM!"},{"$error":"#NUM!"},{"$error":"#NUM!"},{"$error":"#NUM!"},{"$error":"#DIV/0!"},{"$error":"#DIV/0!"},{"$error":"#DIV/0!"},{"$error":"#DIV/0!"},{"$error":"#DIV/0!"},{"$error":"#DIV/0!"},0,0,0,0,0,0,0,0,0,0]
[8,0.03,20,365,10000000,4,5,4,1,30,7,5,7.0000000000000007E-2,0.05,0.1,{"$f":"P11","v":0.3},1,{"$f":"R11","v":2},1,0.1,8,{"$error":"#NUM!"},{"$error":"#NUM!"},{"$error":"#NUM!"},{"$error":"#NUM!"},{"$error":"#NUM!"},{"$error":"#NUM!"},{"$error":"#NUM!"},{"$error":"#NUM!"},{"$error":"#NUM!"},{"$error":"#DIV/0!"},{"$error":"#DIV/0!"},{"$error":"#DIV/0!"},{"$error":"#DIV/0!"},{"$error":"#DIV/0!"},{"$error":"#DIV/0!"},0,0,0,0,0,0,0,0,0,0]