{"text_format":"1","workbook":"xlsx","n_sheets":15,"sheets":["Tools","Matrice","Covariance","Cholesky","ValVecPropres","Halton","Calcul Matriciel","Exercice1","ExoCorrec1","Exercice2","ExoCorrec2","Rates","CalculVAR","MonteCarlo","Réponses"],"not_rendered":{"charts":0,"images":2,"macros":1,"external_links":4,"defined_names":14,"comments":0,"pivot_tables":0},"unopened":[],"bounds":{"document_bytes":16777216,"sheet_cells":100000,"rows_first":2000,"rows_last":500,"rows_between":2000,"halvings":0,"cell_chars":16384,"cell_head_chars":4096},"cells_cut":0,"cells_raw":0,"read":"whole","date_system":"1900"}

{"sheet":"Tools","index":0,"n_rows":29,"n_cols":5,"rows_kept":29,"cut":false,"hidden":false,"merged":[]}
["FONCTIONS EXCEL POUR LA VALUE AT RISK"]
[]
[null,"Fonction ","Calcul","Entrée","Sortie"]
[]
[null,"MInverse(M)","Inverse la matrice","Matrice carrée nxn","Matrice carrée nxn"]
[null,"MTranspose(M)","Transpose la matrice","Matrice ou Vecteur","Matrice ou Vecteur"]
[null,"MDeterminant(M)","Déterminant de la matrice","Matrice carrée nxn","Nombre"]
[null,"MProd(Mx, My)","Produit matriciel","2 Matrices compatibles","Matrice ou Nombre"]
[null,"MTProd(Mx, My)","Produit transposée x matrice: tMx My","2 Matrices compatibles","Matrice ou Nombre"]
[null,"MQuadProd(Mx, My)","Produit quadratique: tMx My Mx","2 Matrices compatibles","Nombre"]
[null,"MQuadProdBaseR(Mx, My)","Produit quadratique: Mx My inv(Mx)","2 Matrices compatibles","Nombre"]
[null,"MQuadProdBaseG(Mx, My)","Produit quadratique: inv(Mx) My Mx","2 Matrices compatibles","Nombre"]
[null,"MZero(n,m)","Matrice Zero","Tailles n et m ","Matrice nxm"]
[null,"MId(n)","Matrice Identité","Taille n","Matrice unitaire carrée nxn"]
[null,"MScal(n,k)","Matrice Scalaire de diagonale k","Taille n et k","Matrice diagonale carrée nxn"]
[null,"MDiagVP(P)","Matrice diagonale quelconque","Vecteur Colonne","Matrice diagonale nxn"]
[null,"MPlus(M,k)","Addition d'un nombre à une matrice","Matrice nxm et k","Matrice nxm"]
[null,"MMult(M,k)","Multiplication d'un nombre par une matrice","Matrice nxm et k","Matrice nxm"]
[]
[null,"MCentre(M)","Matrice Centrée","Matrice carrée nxm","Matrice carrée nxm"]
{"$rows_left_out":10}
{"sheet":"Matrice","index":1,"n_rows":85,"n_cols":6,"rows_kept":85,"cut":false,"hidden":false,"merged":[]}
["FONCTIONS MATRICIELLES"]
[]
[null,"Matrice Mx"]
[null,15,-85,0,-20]
[null,3,55,6,55]
[null,-7,1,-33,0]
[null,2,-4,8,4]
[]
[null,"Déterminant de la matrice"]
[null,{"$f":"Mdeterminant($B$4:$E$7)","v":-199509.99999999991},null,null,null,{"$f":"form(B10)","v":"=Mdeterminant($B$4:$E$7)"}]
[null,"Inverse de la matrice"]
[null,{"$f":"_xludf.Minverse($B$4:$E$7)","v":7.069319833592301E-2},6.8668237181093675E-2,-0.1307202646483886,-0.59072226956042329,{"$f":"form(B12)","v":"=Minverse($B$4:$E$7)"}]
[null,1.6139541877600127E-3,1.0926770587940456E-2,-3.2479574958648699E-2,-0.14217332464538124]
[null,-1.4946619217081852E-2,-1.4234875444839857E-2,-3.5587188612099577E-3,0.12099644128113882]
[null,-3.8394065460377936E-3,5.0624028870733277E-3,3.9997995087965532E-2,0.16119492757255283]
[null,"Transpose de la matrice"]
[null,{"$f":"MTran($B$4:$E$7)","v":15},3,-7,2,{"$f":"form(B17)","v":"=MTran($B$4:$E$7)"}]
[null,-85,55,1,-4]
[null,0,6,-33,8]
[null,-20,55,0,4]
{"$rows_left_out":66}
{"sheet":"Covariance","index":2,"n_rows":63,"n_cols":8,"rows_kept":63,"cut":false,"hidden":false,"merged":[]}
["FONCTIONS MCENTRE MREDUITE MCOVARIANCE MCORRELATION"]
["MATRICE DE COVARIANCE, MATRICE DE CORRELATION"]
[null,"Matrice Entrée"]
[null,null,1,2,3,4,5]
[null,1,1.0439000000000001,0.83889999999999998,1.0750999999999999,123.38,9.0623000000000005]
[null,2,1.0422,0.84140000000000004,1.0709,122.19,9.0485000000000007]
[null,3,1.0364,0.83977999999999997,1.0687,122.43,9.0343]
[null,4,1.0421,0.84240000000000004,1.0689,122.31,9.0259999999999998]
[null,5,1.0444,0.84645000000000004,1.0706,122.86,9.0975000000000001]
[null,6,1.0446,0.85277999999999998,1.0710999999999999,122.6,9.0928000000000004]
[null,7,1.0445,0.85299999999999998,1.0753999999999999,122.61,9.1077999999999992]
[null,8,1.0401,0.85128000000000004,1.0713999999999999,122.39,9.0777000000000001]
[null,9,1.0452999999999999,0.85299999999999998,1.0713999999999999,122.04,9.0757999999999992]
[null,10,1.0541,0.85618000000000005,1.0739000000000001,123.4,9.0862999999999996]
[null,"Calculs intermédiaires:"]
[null,"MOYENNE",{"$f":"AVERAGE(C5:C14)","v":1.04376},{"$f":"AVERAGE(D5:D14)","v":0.84751700000000008},{"$f":"AVERAGE(E5:E14)","v":1.0717400000000001},{"$f":"AVERAGE(F5:F14)","v":122.62100000000001},{"$f":"AVERAGE(G5:G14)","v":9.0708999999999982},{"$f":"form(C16)","v":"=MOYENNE(C5:C14)"}]
[null,"ECART TYPE",{"$f":"STDEVP(C5:C14)","v":4.2863037689832512E-3},{"$f":"STDEVP(D5:D14)","v":6.130964116678554E-3},{"$f":"STDEVP(E5:E14)","v":2.2204504047602575E-3},{"$f":"STDEVP(F5:F14)","v":0.4416435214061214},{"$f":"STDEVP(G5:G14)","v":2.6052792556652989E-2},{"$f":"form(C17)","v":"=ECARTYPEP(C5:C14)"}]
[null,"Matrice Centrée"]
[null,null,{"$f":"mcentre(MATAA)","v":1.4000000000002899E-4},-8.6170000000000968E-3,3.3599999999998076E-3,0.75899999999998613,-8.5999999999977206E-3,{"$f":"form(C19)","v":"=mcentre(MATAA)"}]
[null,null,-1.5600000000000058E-3,-6.1170000000000391E-3,-8.4000000000017394E-4,-0.4310000000000116,-2.2399999999997533E-2]
{"$rows_left_out":44}
{"sheet":"Cholesky","index":3,"n_rows":23,"n_cols":8,"rows_kept":23,"cut":false,"hidden":false,"merged":[]}
["FONCTION CHOLESKY"]
["MATRICE DE CHOLESKY"]
[null,"Matrice Entrée"]
[null,null,1,2,3,4,5]
[null,1,0.99999999999999978,0.63098176605144674,0.56071300409883817,0.57228184509493552,0.52141940196765391]
[null,2,0.63098176605144674,1.0000000000000002,0.35055051125550535,5.2924241678386517E-2,0.7507227739640806]
[null,3,0.56071300409883817,0.35055051125550535,0.99999999999999978,0.61547087809386247,0.6027768832193916]
[null,4,0.57228184509493552,5.2924241678386517E-2,0.61547087809386247,1.0000000000000002,0.32289108368537833]
[null,5,0.52141940196765391,0.7507227739640806,0.6027768832193916,0.32289108368537833,0.99999999999999944]
[]
[null,"Matrice Sortie"]
[null,null,{"$f":"C4","v":1},{"$f":"D4","v":2},{"$f":"E4","v":3},{"$f":"F4","v":4},{"$f":"G4","v":5}]
[null,{"$f":"+B5","v":1},{"$f":"MCholesky(C5:G9)","v":0.99999999999999989},0,0,0,0,{"$f":"form(C13)","v":"=MCholesky(C5:G9)"}]
[null,{"$f":"+B6","v":2},0.63098176605144685,0.77579766106285564,0,0,0]
[null,{"$f":"+B7","v":3},0.56071300409883829,-4.1881672011493008E-3,0.82799962940206151,0,0]
[null,{"$f":"+B8","v":4},0.57228184509493563,-0.3972365258185897,0.35376985948949735,0.62413421541131242,0]
[null,{"$f":"+B9","v":5},0.52141940196765402,0.54359101608953331,0.37764134536741339,0.17116239525208352,0.5106085224505188]
[]
[null,null,{"$f":"MMULT(C13:G17,TRANSPOSE(C13:G17))-C5:G9","v":0},0,0,0,0]
[null,null,0,0,0,-2.0816681711721685E-17,1.1102230246251565E-16]
{"$rows_left_out":4}
{"sheet":"ValVecPropres","index":4,"n_rows":33,"n_cols":8,"rows_kept":33,"cut":false,"hidden":false,"merged":[]}
["FONCTIONS VALP et VECP"]
["VALEURS PROPRES ET VECTEURS PROPRES"]
[null,"Matrice Entrée"]
[null,null,1,2,3,4,5]
[null,1,1.8372400000000024E-5,1.6581679999999952E-5,5.3366000000001295E-6,1.0833400000000118E-3,5.8226999999999095E-5]
[null,2,1.6581679999999952E-5,3.758872100000004E-5,4.7722199999999936E-6,1.4330300000000564E-4,1.1991199999999831E-4]
[null,3,5.3366000000001295E-6,4.7722199999999936E-6,4.9303999999999909E-6,6.0356000000000971E-4,3.4869999999999685E-5]
[null,4,1.0833400000000118E-3,1.4330300000000564E-4,6.0356000000000971E-4,0.19504899999999922,3.7151999999999997E-3]
[null,5,5.8226999999999095E-5,1.1991199999999831E-4,3.4869999999999685E-5,3.7151999999999997E-3,6.7874799999999335E-4]
[]
[null,"Valeurs Propres"]
[null,null,{"$f":"MvalP(C5:G9)","v":0.19512799126343597},6.3434671366345921E-4,2.0571479961342754E-5,3.7536142804997724E-6,1.9764496579804553E-6,{"$f":"form(C12)","v":"=MvalP(C5:G9)"}]
[null,null,{"$f":"vprpgm(C5:G9)","v":0.1951284487959053},null,null,null,null,{"$f":"form(C13)","v":"=vprpgm(C5:G9)"}]
[null,"Vecteurs Propres"]
[null,null,{"$f":"Mvecp(C5:G9)","v":5.5571907995008215E-3},6.4042113413756666E-2,0.60358411003938084,0.75086877360914217,-0.26028836367880243,{"$f":"form(C15)","v":"=Mvecp(C5:G9)"}]
[null,null,7.4668847411716395E-4,0.19396319005940604,0.77357810796435988,-0.57370341114206791,0.18659858059625761]
[null,null,3.0961838486059344E-3,3.7682355708561065E-2,1.9760860434992378E-3,0.32298288332413183,0.94564718890155219]
[null,null,0.99979696436945487,-1.930607789525747E-2,-2.5024108422175913E-4,-5.740013267484796E-3,-5.4315836925529243E-4]
[null,null,1.9105071838105472E-2,0.97800010431289508,-0.19302633356513393,5.2053724074049394E-2,-5.6409543115072583E-2]
[]
{"$rows_left_out":14}
{"sheet":"Halton","index":5,"n_rows":17,"n_cols":8,"rows_kept":17,"cut":false,"hidden":false,"merged":[]}
["FONCTION HALTON"]
["NOMBRES DE HALTON"]
[]
[null,"p","k","Halton",null,"p","k ","Halton"]
[null,3,1,{"$f":"halton(B5,C5)","v":0.33333333333333331},null,5,1,{"$f":"halton(F5,G5)","v":0.2}]
[null,3,{"$f":"C5+1","v":2},{"$f":"halton(B6,C6)","v":0.66666666666666663},null,5,{"$f":"G5+1","v":2},{"$f":"halton(F6,G6)","v":0.4}]
[null,3,{"$f":"C6+1","v":3},0.1111111111111111,null,5,{"$f":"G6+1","v":3},0.60000000000000009]
[null,3,{"$f":"C7+1","v":4},0.44444444444444442,null,5,{"$f":"G7+1","v":4},0.8]
[null,3,5,0.77777777777777768,null,5,5,0.04]
[null,3,6,0.22222222222222221,null,5,6,0.24000000000000002]
[null,3,7,0.55555555555555558,null,5,7,0.44]
[null,3,8,0.88888888888888884,null,5,8,0.64000000000000012]
[null,3,9,3.7037037037037035E-2,null,5,9,0.84000000000000008]
[null,3,10,0.37037037037037035,null,5,10,0.08]
[null,3,11,0.70370370370370372,null,5,11,0.28000000000000003]
[null,3,12,0.14814814814814814,null,5,12,0.48000000000000004]
[null,3,13,0.48148148148148145,null,5,13,0.68]

{"sheet":"Calcul Matriciel","index":6,"n_rows":97,"n_cols":13,"rows_kept":97,"cut":false,"hidden":false,"merged":[]}
["MATRICES - Exemples"]
[]
[null,"PRINCIPE DE SAISIE",null,"SI L'ARGUMENT DE SORTIE EST UNE TABLE",null,null,null,"SELECTIONNER LA ZONE DE SORTIE EN PREMIER"]
[null,null,null,null,null,null,null,"SAISIR LA FORMULE"]
[null,null,null,null,null,null,null,"PUIS SAISIR LA SEQUENCE SUIVANTE : CTRL +  MAJ  et ENTER"]
[]
[]
["ADDITION DE DEUX MATRICES",null,null,"Somme des cellules en référence relative",null,null,null,null,null,null,null,null,"Fonction"]
["FONCTION ALGEBRIQUE: PLUS (+)"]
[null,null,"A",null,"+",null,"B",null,"=",null,"S"]
[]
[null,3,-2,6,null,4,0,4,null,{"$f":"B12:D13+F12:H13","v":7},-2,10,{"$f":"form(J12)","v":"=B12:D13+F12:H13"}]
[null,2,-7,-6,null,-6,1,0,null,-4,-6,-6]
[]
["MULTIPLICATION PAR UN NOMBRE",null,null,"Multiplication des cellules en référence absolue"]
["FONCTION ALGEBRIQUE: MULTIPLICATION (*)"]
[null,null,null,"a","x",null,"A",null,"=",null,"aA"]
[]
[null,null,null,5,null,3,-2,6,null,{"$f":"D19*F19:H20","v":15},-10,30,{"$f":"form(J19)","v":"=D19*F19:H20"}]
[null,null,null,null,null,2,-7,-6,null,10,-35,-30]
{"$rows_left_out":78}
{"sheet":"Exercice1","index":7,"n_rows":93,"n_cols":17,"rows_kept":93,"cut":false,"hidden":false,"merged":[]}
["MATRICES Exercices - Application avec Autocorrection"]
[]
[]
["ADDITION DE DEUX MATRICES"]
[null,"matrice A",null,null,null,"matrice B",null,null,null,null,null,"A+B"]
[null,15,-85,0,null,8,78,0,"OK",{"$f":"AND(L6:N9=ExoCorrec1!L6:N9)","v":false},null,null,null,null,{"$f":"form(L6)","v":""}]
[null,0,55,6,null,88,0,6]
[null,-7,0,-33,null,4,1,5]
[null,2,-4,8,null,-7,-22,-77]
[]
["MULTIPLICATION PAR UN NOMBRE"]
[null,"matrice A",null,null,null,"scalaire b",null,null,null,null,null,"A.b"]
[null,15,-85,0,null,8,null,null,"OK",{"$f":"AND(L13:N16=ExoCorrec1!L13:N16)","v":false},null,null,null,null,{"$f":"form(L13)","v":""}]
[null,0,55,6]
[null,-7,0,-33]
[null,2,-4,8]
[]
["DETERMINANT D'UNE MATRICE"]
[null,"matrice A",null,null,null,null,null,null,null,null,null,"determinant (A)"]
[null,15,-85,0,5,null,null,null,"OK",{"$f":"AND(L20=ExoCorrec1!L20)","v":false},null,null,null,null,{"$f":"form(L20)","v":""}]
{"$rows_left_out":74}
{"sheet":"ExoCorrec1","index":8,"n_rows":93,"n_cols":17,"rows_kept":93,"cut":false,"hidden":true,"merged":[]}
["MATRICES Exercices - Application avec Autocorrection"]
[]
[]
["ADDITION DE DEUX MATRICES"]
[null,"matrice A",null,null,null,"matrice B",null,null,null,null,null,"A+B"]
[null,15,-85,0,null,8,78,0,"OK",null,null,{"$f":"B6:D9+F6:H9","v":23},-7,0,{"$f":"form(L6)","v":"=B6:D9+F6:H9"}]
[null,0,55,6,null,88,0,6,null,null,null,88,55,12]
[null,-7,0,-33,null,4,1,5,null,null,null,-3,1,-28]
[null,2,-4,8,null,-7,-22,-77,null,null,null,-5,-26,-69]
[]
["MULTIPLICATION PAR UN NOMBRE"]
[null,"matrice A",null,null,null,"scalaire b",null,null,null,null,null,"A.b"]
[null,15,-85,0,null,8,null,null,"OK",null,null,{"$f":"B13:D16*F13","v":120},-680,0,{"$f":"form(L13)","v":"=B13:D16*F13"}]
[null,0,55,6,null,null,null,null,null,null,null,0,440,48]
[null,-7,0,-33,null,null,null,null,null,null,null,-56,0,-264]
[null,2,-4,8,null,null,null,null,null,null,null,16,-32,64]
[]
["DETERMINANT D'UNE MATRICE"]
[null,"matrice A",null,null,null,null,null,null,null,null,null,"determinant (A)"]
[null,15,-85,0,5,null,null,null,"OK",null,null,{"$f":"MDETERM(B20:E23)","v":-212325},null,null,{"$f":"form(L20)","v":"=DETERMAT(B20:E23)"}]
{"$rows_left_out":74}
{"sheet":"Exercice2","index":9,"n_rows":88,"n_cols":14,"rows_kept":88,"cut":false,"hidden":false,"merged":[]}
["MATRICES Exercices 2"]
[]
[]
["CALCUL DU PRODUIT MATRICIEL D'UNE MATRICE PAR SA TRANSPOSEE"]
[]
[]
[null,11,3,5,8,null,null,"OK",{"$f":"AND(J7:M10=ExoCorrec2!J7:M10)","v":false},null,null,null,null,{"$f":"form(K7)","v":""}]
[null,1,12,14,-6]
[null,-22,3,5,4]
[null,11,6,4,12]
[null,null,null,null,null,null,null,null,null,"matrice symétrique"]
["MATRICE DE CHOLESKY DE LA MATRICE SUIVANTE"]
[]
[]
[null,{"$f":"J7:M10","v":0},0,0,0,null,null,"OK",{"$f":"AND(J15:M18=ExoCorrec2!J15:M18)","v":{"$error":"#NAME?"}},null,null,null,null,{"$f":"form(M15)","v":""}]
[null,0,0,0,0]
[null,0,0,0,0]
[null,0,0,0,0]
[]
["VERIFICATION PAR LE CALCUL DU CARRE DE LA MATRICE DE CHOLESKY: A . TA"]
{"$rows_left_out":69}
{"sheet":"ExoCorrec2","index":10,"n_rows":91,"n_cols":13,"rows_kept":91,"cut":false,"hidden":true,"merged":[]}
["MATRICES Exercices"]
[]
[]
["CALCUL DU PRODUIT MATRICIEL D'UNE MATRICE PAR SA TRANSPOSEE",null,null,null,null,null,"On obtient une matrice symétrique"]
[]
[]
[null,11,3,5,8,null,null,null,null,{"$f":"MMULT(B7:E10,TRANSPOSE(B7:E10))","v":219},69,-176,255]
[null,1,12,14,-6,null,null,null,null,69,377,60,67]
[null,-22,3,5,4,null,null,null,null,-176,60,534,-156]
[null,11,6,4,12,null,null,null,null,255,67,-156,317]
[]
["MATRICE DE CHOLESKY DE LA MATRICE SUIVANTE"]
[]
[]
[null,{"$f":"J7:M10","v":219},69,-176,255,null,null,null,null,{"$f":"cholesky(B15:E18)","v":{"$error":"#NAME?"}},{"$error":"#NAME?"},{"$error":"#NAME?"},{"$error":"#NAME?"}]
[null,69,377,60,67,null,null,null,null,{"$error":"#NAME?"},{"$error":"#NAME?"},{"$error":"#NAME?"},{"$error":"#NAME?"}]
[null,-176,60,534,-156,null,null,null,null,{"$error":"#NAME?"},{"$error":"#NAME?"},{"$error":"#NAME?"},{"$error":"#NAME?"}]
[null,255,67,-156,317,null,null,null,null,{"$error":"#NAME?"},{"$error":"#NAME?"},{"$error":"#NAME?"},{"$error":"#NAME?"}]
[]
["VERIFICATION PAR LE CALCUL DU CARRE DE LA MATRICE DE CHOLESKY: A . TA"]
{"$rows_left_out":72}
{"sheet":"Rates","index":11,"n_rows":776,"n_cols":15,"rows_kept":776,"cut":false,"hidden":false,"merged":[]}
[null,null,"ccy pour 1 eur","USD","GBP","CHF"]
[null,null,null,1,{"$f":"D2+1","v":2},{"$f":"E2+1","v":3},null,null,null,null,null,null,null,"CENTILE"]
[null,null,"MIN",null,null,null,null,null,{"$f":"form(J3)","v":""},null,null,null,0.05]
[null,null,"MAX",null,null,null,null,null,"",null,null,null,"histo",{"$f":"PERCENTILE(N9:N775,M3)","v":-41175.624979044573},{"$f":"form(N4)","v":"=CENTILE(N9:N775;M3)"}]
[null,null,"MOY",null,null,null,null,null,"",null,null,null,"param"]
[null,null,"STD",null,null,null,null,null,"=ECARTYPEP(J9:J775)",{"$f":"STDEVP(J9:J775)","v":5.8921872678338394E-3},null,null,null,"PL HISTO"]
[null,null,null,null,null,null,null,null,null,"RETURN",null,null,null,"USD"]
[null,null,"DATES",{"$f":"D1","v":"USD"},{"$f":"E1","v":"GBP"},{"$f":"F1","v":"CHF"},null,null,{"$f":"form(J8)","v":""},null,null,null,null,{"$f":"CalculVAR!F9","v":4608681.0792693142}]
[null,1,"2015-01-02",1.2042999999999999,null,null,null,null,null,{"$f":"-LN(D10/D9)","v":1.0685467727637276E-2},null,null,null,{"$f":"$N$8*J9","v":49245.912939504786}]
[null,{"$f":"B9+1","v":2},"2015-01-05",1.1915,null,null,null,null,null,{"$f":"-LN(D11/D10)","v":8.393134420973494E-5},null,null,null,{"$f":"$N$8*J10","v":386.81279801704551}]
[null,{"$f":"B10+1","v":3},"2015-01-06",1.1914,null,null,null,null,null,6.990973934969902E-3,null,null,null,32219.169299760732]
[null,4,"2015-01-07",1.1831,null,null,null,null,null,5.3392219723893217E-3,null,null,null,24606.771282169655]
[null,5,"2015-01-08",1.1768000000000001,null,null,null,null,null,-3.8166366672463419E-3,null,null,null,-17589.661194783708]
[null,6,"2015-01-09",1.1813,null,null,null,null,null,7.621628856900605E-4,null,null,null,3512.5656706010832]
[null,7,"2015-01-12",1.1803999999999999,null,null,null,null,null,1.8655139811973192E-3,null,null,null,8597.5589882564564]
[null,8,"2015-01-13",1.1781999999999999,null,null,null,null,null,5.9430319701407586E-4,null,null,null,2738.9538994280351]
[null,9,"2015-01-14",1.1775,null,null,null,null,null,5.7062710728420065E-3,null,null,null,26298.383526588765]
[null,10,"2015-01-15",1.1708000000000001,null,null,null,null,null,1.0302288922535473E-2,null,null,null,47479.964030455085]
[null,11,"2015-01-16",1.1588000000000001,null,null,null,null,null,-1.4659598192964152E-3,null,null,null,-6756.1412821604517]
[null,12,"2015-01-19",1.1605000000000001,null,null,null,null,null,2.2429270962644817E-3,null,null,null,10336.93567073458]
{"$rows_left_out":757}
{"sheet":"CalculVAR","index":12,"n_rows":102,"n_cols":12,"rows_kept":102,"cut":false,"hidden":false,"merged":[]}
["VAR PARAMETRIQUE ET HISTORIQUE"]
[]
[]
[null,null,"Saisie des devises 4 et 5",null,null,"USD","GBP","CHF"]
[null,null,null,null,"Portefeuille",5500000,-4500000,2800000,null,null,"PORTEFEUILLE"]
[null,null,"Cours FX à la date",null,"2014-01-02"]
[null,null,"Contrevaleur Euro",null,null,null,null,null,null,null,null,"Réponse 1.1"]
[null,null,"Cours FX à la date",null,"2016-12-30",{"$f":"1/Rates!D775","v":0.83794201441260263}]
[null,null,"Contrevaleur Euro",null,null,{"$f":"F5*F8","v":4608681.0792693142}]
[null,null,"RESULTAT sur 3 ans",null,null,null,null,null,null,null,null,"Réponse 1.2"]
[]
[null,null,"RISQUE",null,0.02,null,null,null,null,null,null,"Réponse 1.3"]
[]
[null,null,"STATISTIQUES",null,"moyenne"]
[null,null,"sur les rendements",null,"écart type",null,null,null,null,null,null,"Réponse 2.1"]
[null,null,null,null,"centile 5%"]
[null,null,null,null,"centile 95%",null,null,null,null,null,"alpha","beta"]
[null,null,null,null,"alpha écart type",null,null,null,null,null,{"$f":"NORMSINV(0.95)","v":1.6448536269514715}]
[]
[null,null,null,null,"param",null,null,null,null,null,null,"Réponse 4.0"]
{"$rows_left_out":83}
{"sheet":"MonteCarlo","index":13,"n_rows":2017,"n_cols":30,"rows_kept":2017,"cut":false,"hidden":false,"merged":[]}
["QUASI MONTE CARLO",null,null,null,null,null,null,null,null,null,null,null,"MONTE CARLO CHOLESKY",null,null,null,null,null,null,null,null,"MONTE CARLO RACINE CARREE"]
[]
[null,null,null,null,null,null,null,null,null,null,null,null,{"$f":"CalculVAR!F5","v":5500000},{"$f":"CalculVAR!G5","v":-4500000},{"$f":"CalculVAR!H5","v":2800000},null,null,null,null,null,null,{"$f":"M3","v":5500000},{"$f":"N3","v":-4500000},2800000]
[]
[]
[]
[]
[]
[null,3,5,7,11,13]
[null,"U1","U2","U3","U4","U5",null,"N1","N2","N3","N4","N5","V1","V2","V3","V4","V5","PORTEFEUILLE",null,null,null,"V1","V2","V3","V4","V5","PORTEFEUILLE"]
[1,{"$f":"halton(B$9,$A11)","v":0.33333333333333331},{"$f":"halton(C$9,$A11)","v":0.2}]
[2,{"$f":"halton(B$9,$A12)","v":0.66666666666666663},{"$f":"halton(C$9,$A12)","v":0.4}]
[3]
[4]
[5]
[6]
[7]
[8]
[9]
[10]
{"$rows_left_out":1998}
{"sheet":"Réponses","index":14,"n_rows":124,"n_cols":4,"rows_kept":124,"cut":false,"hidden":false,"merged":[]}
[null,null,"Numéro/Nom/ Prénom: /….. /  ……………………/………………"]
[null,null,null," "]
[1,1,"Contrevaleur Euro du Portefeuille au 2 janvier 14"]
[1,2,"Résultat en euro entre le 2 1 2013 et le 30 12 2016"]
[1,3,"Risque Forfaitaire 2% au 30 12 2016"]
[2,1,"Ecart type sur la devise 4"]
[2,2,"Corrélation entre devise 4 et devise 5"]
[2,3,"Trace de la matrice de Cholesky sur VCV"]
[2,4,"Valeurs Propres VCV"]
[]
[]
[]
[]
[]
[2,5,"Vecteur Propre 01"]
[]
[]
[]
[]
[]
{"$rows_left_out":104}